program: Gaussian 09
title: 000133370
version: EM64L-G09RevD.01
frameworkgroup: C1[X(C23H26O4)]
method: RPBEPBE
basis: SDD
operation: Freq
keyword: #pfreq=noraman
keyword: PBEPBE/SDD
title: #p freq=noraman PBEPBE/SDD
converged: YES YES NO NO
title: Mulliken charges:
elementType: O O O O C C C C C C C C C C C C C C C C C C C C C C C H H H H H H H H H H H H H H H H H H H H H H H H H H
charge: -0.194623 -0.250997 -0.265212 -0.240057 -0.144795 -0.610202 -0.448291 0.345151 -0.055542 0.168573 -0.525101 -0.536132 -0.364718 0.349892 -0.367414 0.245781 -0.261929 -0.367599 -0.461887 -0.344900 0.479764 -0.686871 -0.401639 -0.375679 -0.225837 -0.226222 -0.229273 0.244559 0.241011 0.234505 0.253791 0.242367 0.246861 0.241727 0.264195 0.275162 0.259657 0.223912 0.220213 0.205719 0.208622 0.216097 0.217372 0.197877 0.196158 0.211341 0.218815 0.212597 0.234144 0.236184 0.230459 0.230019 0.232395
chargesum: 0.00000
title: Mulliken charges with hydrogens summed into heavy atoms:
elementType: O O O O C C C C C C C C C C C C C C C C C C C C C C C
charge: -0.194623 -0.250997 -0.265212 -0.240057 0.099765 -0.134686 0.047867 0.345151 -0.055542 0.168573 -0.036513 -0.271937 -0.089555 0.349892 -0.107758 0.245781 0.182196 0.046742 -0.028419 0.049136 0.479764 -0.044118 -0.167495 -0.139495 0.004622 0.003797 0.003122
polarizability: 4.13871853e+02 2.90647730e+01 2.20387075e+02 -7.74683918e+00 -3.07824465e+00 1.90571968e+02
1716.lowfreq: -20.1339 -3.5793 -0.0014 0.0006 0.0012 3.9429 4.3894 5.4494 10.0977
frequency: -18.6683 3.8263 9.7821 24.8106 27.1312 38.5891 41.9875 49.4706 62.6690 72.7222 89.9473 101.3391 109.3915 128.5240 133.1090 163.9726 175.0459 197.2033 209.7156 218.9040 236.3427 255.5415 270.7829 283.1418 314.9958 343.3578 370.2978 402.2415 408.0058 414.2824 431.8080 449.7139 470.4996 509.3219 530.7239 548.4490 572.5641 583.3575 598.5018 617.3789 626.6957 674.0719 692.0804 701.9239 728.4338 738.3515 741.4564 765.3506 769.2479 795.3161 796.6169 836.7193 844.1580 850.5550 852.9828 855.8014 890.5121 895.5129 909.5975 929.1605 931.5786 932.9241 938.8612 950.7018 976.8309 977.5645 982.1097 991.1124 998.7143 1014.7916 1026.8740 1040.2850 1051.7070 1071.0005 1081.6426 1084.9208 1090.4977 1103.9510 1124.5262 1126.8905 1144.6397 1147.2931 1158.8258 1173.9942 1187.8906 1189.6302 1198.1266 1204.7379 1211.5013 1222.3450 1229.8291 1245.3340 1268.4264 1269.7570 1271.9099 1272.9375 1286.6343 1288.5597 1304.9228 1309.5855 1327.0137 1343.2679 1354.1445 1360.3557 1373.0966 1387.8008 1390.1003 1394.6352 1441.8460 1444.7407 1445.2429 1450.4296 1468.4432 1472.2134 1472.6391 1477.7139 1477.7932 1481.0090 1482.6899 1487.9173 1490.7626 1590.9895 1597.9100 1604.5303 1617.8219 1628.8975 1636.4418 2966.7510 2966.8721 2969.1912 2975.8877 2978.9649 2980.8379 2990.7282 3001.1669 3001.6266 3012.5585 3029.5800 3037.0760 3044.1186 3052.4840 3069.8187 3075.7032 3076.6860 3078.1578 3123.6969 3125.5729 3137.7004 3149.9144 3151.0100 3152.7470 3166.7657 3173.2577
redmass: 2.6783 3.9326 4.2146 3.4563 4.8423 6.8574 3.3578 4.5739 3.7630 3.9612 2.8182 2.1639 4.1953 4.3665 6.0175 5.0108 2.9444 3.1392 6.0803 3.4153 1.1945 4.9724 5.3659 4.7737 4.0303 2.3853 2.9682 2.7936 3.0762 4.7697 3.1513 4.0545 3.5710 3.8190 4.9699 4.3205 3.9667 4.4410 4.1942 6.3397 5.3711 5.4469 4.3876 1.8570 3.1805 1.0698 3.7961 1.9371 1.9355 1.9881 1.4472 3.4457 1.5520 1.7612 1.2545 3.6400 2.5650 3.3256 1.9500 1.2339 2.0253 2.1870 3.2063 3.1925 1.3964 1.5948 1.3650 5.9056 1.3396 3.7527 2.1791 3.2972 3.7451 2.2775 2.1951 2.2174 1.5067 1.9716 2.6203 2.0374 1.5255 1.4874 1.6289 1.0541 1.1593 1.5072 1.0915 1.6471 1.3564 1.3100 2.6876 2.1127 1.2748 1.2845 1.3411 1.5786 1.0845 1.5971 1.2866 1.7040 1.2696 1.4231 1.5952 1.4597 1.6102 8.3611 1.2202 6.5761 2.1934 2.2981 1.4455 1.1795 1.0785 1.0702 1.5578 1.0828 1.0468 1.0626 1.5275 2.3204 1.0907 8.1876 6.1295 7.7857 6.1995 10.4169 10.1261 1.0751 1.0625 1.0587 1.0363 1.0630 1.0645 1.0598 1.0588 1.0581 1.1002 1.1076 1.0992 1.1035 1.0976 1.1036 1.1005 1.0995 1.1051 1.0859 1.0882 1.0919 1.0890 1.0963 1.0908 1.1017 1.0970
irintensity: 0.1390 0.1598 0.1793 0.8020 0.2650 0.9060 0.0585 0.0810 0.6848 0.1269 0.1863 0.0214 0.7891 0.6807 5.5739 0.9700 1.2882 2.3679 6.1912 2.7729 0.7690 8.6905 4.8283 10.8372 2.1625 1.5115 3.2239 0.1576 15.4105 0.0424 8.6589 5.3787 1.1182 6.2795 4.5353 6.1402 11.3848 4.0987 21.3549 0.1656 9.2380 14.5828 12.2908 48.3036 11.8121 8.1736 18.9338 15.6681 35.7697 4.3506 4.0322 22.0188 0.3472 58.2948 1.1199 1.8136 8.5623 32.9059 6.7713 0.2840 6.4287 18.8868 72.0538 102.9838 0.0046 2.8372 0.0834 1.2659 0.0210 32.4235 6.3638 15.5195 76.3558 61.1984 34.7789 168.7276 7.1604 109.6108 4.6054 47.5033 73.1390 7.7149 155.4499 0.0052 5.4119 48.7883 1.4418 62.8933 4.0349 19.6325 71.7332 253.5980 15.1409 4.4280 63.1631 120.1475 0.6061 118.1982 4.6431 5.9056 0.3578 1.0377 48.2016 18.9154 1.7103 0.6854 9.1468 4.0909 9.3232 7.8352 7.8459 20.4774 0.8365 0.1186 59.0026 13.5988 11.0401 6.2025 3.2923 9.9471 20.1466 60.5612 0.8480 620.5641 0.7664 64.9386 169.9059 9.0797 30.9401 27.3619 33.7769 15.7311 12.7175 17.2241 5.1804 47.3971 6.5982 22.4189 17.6779 2.3052 1.4411 3.5916 22.5295 50.9085 126.7586 5.9452 2.3637 14.7257 3.9483 36.5823 13.1993 23.1171 7.2558
temp: 298.150 k
press: 1.00000 atm
elementType: 8 8 8 8 6 6 6 6 6 6 6 6 6 6 6 6 6 6 6 6 6 6 6 6 6 6 6 1 1 1 1 1 1 1 1 1 1 1 1 1 1 1 1 1 1 1 1 1 1 1 1 1 1
symmnumber: 1
zpe: 1140266.5 jmol-1
zpe.correction: 0.434305 hartree
zpe.thermalcorrener: 0.460109 hartree
zpe.thermalcorrenthalpy: 0.461053 hartree
zpe.thermalcorrgfe: 0.371438 hartree
zpe.sumelectzpe: -1190.971345 hartree
zpe.sumelectthermal: -1190.945541 hartree
zpe.sumelectthermalent: -1190.944597 hartree
zpe.sumelectthermalfe: -1191.034212 hartree
dipole: -1.9089 -5.2342 -2.5281
dipole: 6.1181
quadrupole: -116.9656 -170.8292 -160.7109
quadrupole: -0.1105 -4.4216 -2.3749
quadrupole: 32.5363 -21.3273 -11.2090 -0.1105 -4.4216 -2.3749
hfenergy: -1191.4056498 hartree
pointgroup: C01 [X(C23H26O4)]
dipole: -0.8450563 -2.1240567 -0.7537848 debye
polarizability: 415.7946071|19.6471602|217.3027844|-12.17831|-5.937684|191.733504 unknown
InChI: InChI=1S/C23H26O4/c1-2-3-13-26-22(24)12-9-18-14-19-15-20(10-11-21(19)23(18)25)27-16-17-7-5-4-6-8-17/h4-8,10-11,15,18H,2-3,9,12-14,16H2,1H3
charge 0 multiplicity 1
53 atoms
O  1.42124 3.438893 -0.281566
O  -4.451715 0.460751 0.064328
O  6.136808 -0.959338 -0.23782
O  4.930254 -0.616826 1.726053
C  1.641557 0.997177 -0.767433
C  0.587454 -0.144944 -0.625325
C  2.92659 0.824375 0.072521
C  -0.740021 0.571006 -0.396658
C  0.882294 2.303602 -0.40417
C  -0.548479 1.966541 -0.250493
C  3.832807 -0.304012 -0.469022
C  -2.026735 0.006711 -0.300299
C  -1.643499 2.830982 0.006867
C  -3.122535 0.87698 -0.051403
C  -2.929662 2.283504 0.103633
C  4.981995 -0.623404 0.473855
C  7.328217 -1.335318 0.585672
C  8.450662 -1.704384 -0.38364
C  -4.739204 -0.993706 -0.093377
C  9.74168 -2.111099 0.366826
C  -6.22922 -1.188401 0.047154
C  10.887188 -2.489616 -0.596087
C  -6.789733 -1.576612 1.28902
C  -7.086854 -0.974806 -1.061251
C  -8.18575 -1.748599 1.423672
C  -8.482618 -1.143162 -0.929776
C  -9.034634 -1.532035 0.313637
H  1.934541 1.101376 -1.833972
H  0.82915 -0.790592 0.242637
H  0.549777 -0.803682 -1.512483
H  3.47616 1.784223 0.070917
H  2.664761 0.607632 1.125095
H  4.237866 -0.057174 -1.465749
H  3.241597 -1.23595 -0.584412
H  -2.167655 -1.072602 -0.410722
H  -1.474259 3.906431 0.122326
H  -3.810285 2.903466 0.295904
H  7.593466 -0.473672 1.226215
H  7.047416 -2.178149 1.244684
H  8.115523 -2.53716 -1.031682
H  8.658606 -0.843376 -1.047568
H  -4.380588 -1.314452 -1.092111
H  -4.18417 -1.552179 0.686193
H  10.067743 -1.27628 1.019886
H  9.524542 -2.966528 1.038337
H  10.598718 -3.341446 -1.240129
H  11.799276 -2.777514 -0.042455
H  11.145972 -1.641589 -1.257438
H  -6.132785 -1.738108 2.152315
H  -6.659718 -0.669077 -2.023923
H  -8.609329 -2.049278 2.388154
H  -9.137638 -0.974363 -1.79151
H  -10.117373 -1.665817 0.415874
