program: Gaussian 09
title: 000133354
version: EM64L-G09RevD.01
frameworkgroup: C1[X(C22H26FN3O2)]
method: RPBEPBE
basis: SDD
operation: Freq
keyword: #p
keyword: freq=noraman
keyword: PBEPBE/SDD
title: #p freq=noraman PBEPBE/SDD
converged: YES YES NO NO
title: Mulliken charges:
elementType: F O O N N N C C C C C C C C C C C C C C C C C C C C C C H H H H H H H H H H H H H H H H H H H H H H H H H H
charge: -0.211482 -0.319365 -0.289648 -0.424024 -0.056449 -0.546189 -0.009714 -0.435789 -0.354594 0.447609 -0.713339 -0.296754 0.326282 -0.410328 -0.620900 -0.088473 0.266805 0.327344 -0.343077 -0.790419 -0.393159 0.397785 -0.522951 -0.281242 -0.375389 -0.358323 -0.343522 0.307541 0.201996 0.194473 0.201685 0.186391 0.208628 0.327514 0.214397 0.237834 0.212005 0.206246 0.204395 0.268058 0.227983 0.248921 0.249322 0.214692 0.239913 0.263467 0.261556 0.254068 0.217573 0.233253 0.269911 0.257570 0.254069 0.255843
chargesum: 0.00000
title: Mulliken charges with hydrogens summed into heavy atoms:
elementType: F O O N N N C C C C C C C C C C C C C C C C C C C C C C
charge: -0.211482 -0.319365 -0.289648 -0.096510 -0.056449 -0.021165 0.192281 -0.039631 0.040426 0.447609 -0.049103 -0.296754 0.326282 0.000313 -0.352842 -0.088473 0.266805 0.327344 -0.115094 -0.077485 -0.153246 0.397785 0.181943 -0.011331 -0.117818 -0.104254 -0.087680 0.307541
polarizability: 3.69802071e+02 6.54739432e+00 2.48934545e+02 4.79210364e+00 -3.07219901e+01 2.36787414e+02
1716.lowfreq: -6.1112 -0.9098 0.0005 0.0007 0.0009 4.9013 12.4501 22.3692 23.6100
frequency: 11.8767 22.2519 23.6046 33.2099 35.8462 55.1525 61.2795 69.6270 79.9251 87.1275 96.0300 115.8605 125.2514 138.7622 152.8077 170.1489 193.3202 205.5856 210.8057 215.7204 239.0035 256.3137 261.2232 262.9750 284.8977 294.5555 307.0921 334.1257 359.8179 366.4993 375.2552 396.3752 414.3877 416.6834 430.4155 464.3572 479.4835 490.7410 501.3942 502.2205 526.9781 533.5421 578.4240 596.5397 611.3163 620.3641 647.3241 652.3838 674.6223 696.7299 697.4791 719.2417 728.8275 733.9680 796.0310 800.7969 801.6033 810.2055 823.9682 830.7758 843.2490 844.3062 858.6784 881.4245 904.3669 928.7362 943.5193 946.3998 948.6663 962.9635 977.6523 996.7088 1004.8343 1012.9628 1039.8298 1045.1842 1045.7964 1088.5874 1094.9575 1099.6188 1102.0809 1111.0626 1116.9934 1147.7568 1148.5104 1151.8851 1158.3946 1161.7569 1200.2389 1201.4826 1211.6418 1243.9947 1247.3999 1259.2922 1280.4163 1281.1545 1290.5345 1308.9418 1317.2465 1334.6677 1342.7368 1348.2360 1355.2777 1362.3335 1380.0954 1381.5318 1384.5017 1397.0085 1405.1749 1411.5396 1429.3718 1444.3401 1456.1609 1456.7624 1459.3810 1461.3761 1461.8895 1471.0827 1474.0653 1475.0098 1479.6028 1480.7202 1483.5576 1525.0521 1557.6802 1577.1569 1604.0649 1613.0233 1615.6938 1644.7077 2951.5491 2959.8309 2966.4934 2976.3386 2977.6923 2978.9910 2989.5888 3006.4821 3026.0248 3048.1907 3074.0123 3077.3498 3078.3321 3082.4961 3095.5951 3125.7013 3126.7199 3152.1810 3157.9345 3161.7603 3178.2687 3178.4622 3181.6318 3444.9919 3450.9907 3576.4887
redmass: 5.5280 5.2213 6.1811 4.1561 4.3697 2.0264 2.4114 2.4343 3.0347 3.8762 3.0272 2.7584 7.1484 1.7910 2.3141 4.0005 3.9389 2.2343 1.2994 3.1664 1.3852 2.8044 4.0996 1.1245 3.7397 8.1680 3.6334 3.3235 6.8687 4.3962 5.7340 5.5914 4.9854 3.1438 3.9245 4.1151 3.7957 3.7842 2.9054 2.6016 6.1513 5.8251 5.3069 4.5266 1.5641 6.6438 1.7540 5.0820 1.7207 5.0045 4.2411 7.8907 6.7153 1.1083 3.8522 2.8871 1.3479 1.7122 1.6046 5.8005 1.2267 1.9837 1.9372 6.5566 2.8791 1.3289 1.3333 1.9575 1.4086 1.4040 6.9275 2.7087 2.8624 1.7704 1.4558 1.5663 2.9342 3.2035 2.2473 1.2727 2.9110 1.2467 2.7549 2.0254 1.2617 1.6886 2.0600 2.3862 2.2992 2.5645 3.0642 1.9211 1.6853 1.4181 1.6418 1.3218 1.4301 1.3167 2.5109 1.2032 1.4663 1.3982 1.3956 3.6009 6.3419 1.2823 2.7322 1.9812 1.3462 3.2839 2.2471 1.5474 1.1675 1.1626 1.2763 1.0728 1.3649 1.1859 1.1282 1.1792 1.0764 1.2492 2.1657 4.1323 4.9119 6.0303 7.7123 7.0255 7.6941 1.0884 1.0720 1.0669 1.0676 1.0330 1.0430 1.0528 1.0372 1.0964 1.1011 1.1049 1.0969 1.0999 1.1005 1.1001 1.0997 1.0880 1.1035 1.0965 1.0887 1.0883 1.0916 1.0968 1.0975 1.0757 1.0446 1.0974
irintensity: 0.1420 0.1188 0.1621 0.0576 0.0911 2.5899 2.2240 6.3715 1.2290 1.3467 0.8497 2.6541 0.4872 3.0131 0.4247 0.3042 0.5422 1.9818 2.1424 2.6425 3.3516 3.4782 0.8700 53.8279 6.5669 4.0521 3.9973 7.0016 3.9555 1.3928 0.7722 1.7151 4.3712 0.1310 4.7798 0.5137 11.4742 5.5313 12.6603 15.3895 3.6364 6.7279 5.7899 3.8306 411.4277 0.8163 37.6509 5.9100 32.4871 11.4715 6.4269 5.8419 40.7489 6.5278 14.4378 1.2249 0.5152 3.2652 78.5887 5.2638 31.9554 14.9947 7.2960 12.8765 12.6230 0.5534 0.3737 8.7909 0.0938 2.4941 143.9715 17.2254 16.8647 2.1506 14.4637 8.4427 5.3448 50.2569 8.1586 12.3537 5.0801 7.6923 19.3482 13.6863 2.3096 52.6478 39.0291 211.7540 7.3414 81.5264 145.9877 9.8970 7.3108 3.9632 2.1678 1.9201 3.9130 2.6424 26.8391 2.1914 9.1608 23.1011 14.6152 65.5645 11.5279 14.1385 38.9283 77.1631 29.3859 6.0683 2.9265 36.4517 24.0954 40.3349 44.2369 30.4810 50.8678 12.3203 52.6233 16.5176 30.1227 66.0963 149.2157 207.6032 228.7693 49.9642 13.1516 28.1485 297.9317 31.6599 11.0805 2.9122 27.0483 79.7823 12.2648 127.9572 21.3256 1.4179 4.8776 99.3430 18.5555 52.9919 33.0458 36.1326 16.0762 13.0683 17.8127 37.4484 5.7526 3.2217 9.3324 3.8215 1.6604 51.0717 1.7015 0.1685
temp: 298.150 k
press: 1.00000 atm
elementType: 9 8 8 7 7 7 6 6 6 6 6 6 6 6 6 6 6 6 6 6 6 6 6 6 6 6 6 6 1 1 1 1 1 1 1 1 1 1 1 1 1 1 1 1 1 1 1 1 1 1 1 1 1 1
symmnumber: 1
zpe: 1149194.1 jmol-1
zpe.correction: 0.437705 hartree
zpe.thermalcorrener: 0.465928 hartree
zpe.thermalcorrenthalpy: 0.466873 hartree
zpe.thermalcorrgfe: 0.375951 hartree
zpe.sumelectzpe: -1266.404752 hartree
zpe.sumelectthermal: -1266.376528 hartree
zpe.sumelectthermalent: -1266.375584 hartree
zpe.sumelectthermalfe: -1266.466505 hartree
dipole: 0.7657 1.8526 1.7407
dipole: 2.6549
quadrupole: -177.4771 -164.2454 -161.2295
quadrupole: -12.3940 1.7701 -7.2604
quadrupole: -9.8264 3.4053 6.4211 -12.3940 1.7701 -7.2604
hfenergy: -1266.8424565 hartree
pointgroup: C01 [X(C22H26F1N3O2)]
dipole: 0.3077409 -0.4578535 -0.8869385 debye
polarizability: 369.8196921|-0.758342|266.1559615|-7.8870046|-20.9398613|219.5483769 unknown
InChI: InChI=1S/C22H26FN3O2/c1-14-10-12-25-21-18(26-15(2)5-4-11-24)13-19(27-3)22(20(14)21)28-17-8-6-16(23)7-9-17/h6-10,12-13,15,26H,4-5,11,24H2,1-3H3
charge 0 multiplicity 1
54 atoms
F  -5.8860 1.978718 2.733121
O  -2.533559 -0.512575 -1.012403
O  -1.232642 1.856048 -1.951156
N  3.110909 0.027298 -0.763947
N  2.011061 -2.245261 0.077998
N  6.252233 1.635931 3.389834
C  3.940683 1.160636 -1.198718
C  5.254012 1.176928 -0.377267
C  5.047976 1.429436 1.13309
C  1.742706 -0.061685 -0.877698
C  4.221732 1.115361 -2.723496
C  1.127935 -1.29732 -0.399297
C  -0.311533 -1.480321 -0.435311
C  6.376794 1.401937 1.937346
C  0.912788 0.939163 -1.419421
C  -1.109306 -0.400475 -0.948109
C  -0.49523 0.762446 -1.456862
C  -0.820034 -2.749335 0.055453
C  0.112255 -3.686706 0.529984
C  -2.29161 -3.115431 0.070664
C  1.507445 -3.407628 0.531637
C  -3.314646 0.151893 -0.032475
C  -2.14073 1.595214 -3.089473
C  -2.767428 0.911732 1.026949
C  -4.714168 -0.001751 -0.172575
C  -3.633877 1.525147 1.958206
C  -5.582372 0.61134 0.754669
C  -5.020441 1.362773 1.802211
H  3.384826 2.094807 -0.970523
H  5.782623 0.211074 -0.52943
H  5.915587 1.959809 -0.798494
H  4.557683 2.414807 1.279316
H  4.35504 0.671265 1.550147
H  3.549156 -0.823371 -0.388119
H  4.843995 0.237027 -2.97521
H  3.281269 1.041916 -3.297831
H  4.757194 2.025856 -3.050585
H  6.871525 0.421233 1.791263
H  7.070864 2.161811 1.526728
H  1.31009 1.870911 -1.827867
H  -0.237424 -4.655031 0.903123
H  -2.864543 -2.474229 0.76476
H  -2.75195 -2.987685 -0.923253
H  -2.418821 -4.163767 0.391468
H  2.225886 -4.14593 0.905207
H  5.726317 0.908149 3.884587
H  5.915619 2.573007 3.633829
H  -2.901166 0.838369 -2.834155
H  -1.557159 1.260119 -3.968332
H  -2.616857 2.564362 -3.301005
H  -1.684536 1.031127 1.11817
H  -5.105469 -0.598624 -1.001594
H  -3.242747 2.122813 2.786538
H  -6.668253 0.511264 0.671707
