program: Gaussian 09
title: 000133320
version: EM64L-G09RevD.01
frameworkgroup: C1[X(C16H23NO2)]
method: RPBEPBE
basis: SDD
operation: Freq
keyword: #p
keyword: freq=noraman
keyword: PBEPBE/SDD
title: #p freq=noraman PBEPBE/SDD
converged: NO YES NO NO
title: Mulliken charges:
elementType: O O N C C C C C C C C C C C C C C C C H H H H H H H H H H H H H H H H H H H H H H H
charge: -0.314768 -0.238607 -0.043373 0.270359 -0.552559 -0.050107 -0.491642 -0.463181 0.446398 -0.770787 -0.661262 -0.372581 -0.401114 0.289826 -0.249405 -0.244308 -0.493348 -0.240693 -0.658754 0.202655 0.265981 0.229416 0.221910 0.232558 0.210098 0.242231 0.210789 0.236913 0.222110 0.243636 0.225562 0.187214 0.244664 0.242105 0.223512 0.223628 0.236967 0.238852 0.227959 0.228106 0.212428 0.230611
chargesum: 0.00000
title: Mulliken charges with hydrogens summed into heavy atoms:
elementType: O O N C C C C C C C C C C C C C C C C
charge: -0.314768 -0.238607 -0.043373 0.270359 -0.083922 0.179309 -0.037174 -0.010852 0.446398 -0.100975 -0.004850 -0.127917 -0.159009 0.289826 -0.025893 -0.020680 -0.017528 -0.012734 0.012392
polarizability: 2.03796721e+02 1.10105315e+01 1.69966293e+02 2.20608991e+00 -1.08406734e+01 1.63836062e+02
1716.lowfreq: -14.7536 -0.0008 -0.0005 0.0007 4.1106 9.2265 18.2389 39.8868 47.0979
frequency: 17.9786 39.8388 47.0865 63.7738 67.7702 81.2439 108.8634 143.2819 170.5488 176.1067 203.0225 214.4647 237.8493 252.8546 263.7538 285.6108 308.9427 315.2141 319.7071 327.8567 398.6684 404.0323 430.3041 444.2668 492.8155 527.1789 536.5569 539.0363 568.4762 617.0600 639.5714 647.7341 702.0576 711.9298 719.5430 764.7683 792.1695 805.3346 833.0985 848.5537 851.1422 881.6379 904.1560 920.4755 941.9803 967.1831 975.2033 990.6320 993.6916 1003.4769 1012.3236 1022.5736 1031.8404 1044.2797 1076.2003 1081.0948 1082.1083 1109.0700 1112.7670 1120.7989 1129.2696 1146.9517 1165.7602 1173.1332 1194.1695 1204.6249 1212.2650 1237.6463 1241.6397 1251.8371 1288.5837 1295.6790 1319.1466 1327.0408 1332.6469 1339.0750 1348.0443 1370.2403 1380.4295 1386.6493 1398.2752 1432.9905 1435.8009 1441.7203 1444.0025 1450.7653 1457.8162 1469.5003 1470.8491 1476.0387 1480.4402 1483.3082 1487.7591 1493.6212 1591.4471 1613.1639 1641.2412 2855.7398 2971.8827 2981.6723 2991.1977 2992.8700 2993.4277 2998.5180 2999.3503 3024.0677 3039.9196 3052.5202 3064.4205 3070.8598 3076.0782 3084.2341 3086.7279 3094.3493 3101.5960 3120.5204 3129.0281 3141.6702 3155.2055 3167.3344
redmass: 1.8308 3.6687 3.0181 4.1698 6.2063 3.4665 3.8710 3.1799 1.3879 2.9019 2.6433 1.1362 1.7119 2.4987 3.8459 2.9498 3.8476 1.7808 3.4965 3.1339 2.8448 2.8271 2.0447 3.2614 3.3239 2.5878 2.7002 2.6217 3.3413 6.4016 4.6181 3.7892 1.6791 4.9195 3.3028 2.0864 1.3578 2.0951 2.9626 1.2916 3.4838 2.4283 2.1839 1.5047 2.0262 2.0503 1.4346 4.8196 1.4155 2.0467 1.7963 1.8926 1.9471 2.0621 2.7503 1.6577 1.7139 2.8472 2.2707 1.5103 2.3137 2.2781 1.6965 1.0537 1.1469 2.2555 2.3936 1.9032 1.1853 1.3757 1.4491 1.7003 1.3400 1.2694 1.7395 1.5144 1.3593 1.2995 7.4315 1.2650 1.2136 1.1409 2.1114 1.1239 1.0911 1.0783 1.0913 1.0393 1.0493 1.0685 1.0526 2.1879 1.0513 1.0510 6.1075 6.1094 9.3978 1.0583 1.0807 1.0362 1.0646 1.0600 1.0570 1.0407 1.0616 1.0715 1.0987 1.1014 1.1034 1.0981 1.0987 1.0991 1.0996 1.1001 1.1002 1.0849 1.0876 1.0934 1.0955 1.0994
irintensity: 0.2785 0.3362 0.8532 0.0686 3.2102 0.8836 0.8026 0.9714 0.2165 1.3003 1.4613 0.6304 0.7807 0.5263 3.6255 1.5012 6.7111 1.4010 6.2873 3.4570 0.6292 0.3167 0.4860 1.9793 3.6957 0.0676 11.4213 10.2190 34.0862 0.0570 1.9114 0.5547 56.2770 3.4261 9.8034 59.2778 15.2092 17.4625 4.7391 0.3827 13.2624 8.5259 9.7438 5.0156 5.4489 7.6979 1.6590 0.4938 1.5481 31.0232 26.7446 22.3942 9.2216 20.5723 103.2886 10.2682 14.5875 18.1385 135.9710 34.8623 165.5258 10.7997 1.8940 0.1349 3.0698 15.8024 6.2728 4.4309 0.1556 3.3105 9.4060 37.7329 1.9526 2.1480 43.2191 43.1148 4.0748 0.6499 0.3651 18.6611 19.9964 4.8789 13.9911 14.9986 23.1896 11.1167 17.3429 12.1681 16.4579 16.1709 15.7293 11.1080 3.5153 5.5836 2.3185 3.1171 121.3206 92.2452 8.9191 25.3433 19.4515 55.4227 29.8616 22.3462 21.5224 59.8347 5.0000 23.4173 34.1009 2.4701 57.2805 23.1695 27.1472 29.8522 30.6065 3.1479 1.5822 27.1264 37.4044 13.9000
temp: 298.150 k
press: 1.00000 atm
elementType: 8 8 7 6 6 6 6 6 6 6 6 6 6 6 6 6 6 6 6 1 1 1 1 1 1 1 1 1 1 1 1 1 1 1 1 1 1 1 1 1 1 1
symmnumber: 1
zpe: 939058.5 jmol-1
zpe.correction: 0.357668 hartree
zpe.thermalcorrener: 0.377055 hartree
zpe.thermalcorrenthalpy: 0.377999 hartree
zpe.thermalcorrgfe: 0.309121 hartree
zpe.sumelectzpe: -827.242383 hartree
zpe.sumelectthermal: -827.222996 hartree
zpe.sumelectthermalent: -827.222052 hartree
zpe.sumelectthermalfe: -827.290930 hartree
dipole: 0.0370 -0.8430 -1.2815
dipole: 1.5343
quadrupole: -114.3981 -108.5090 -112.8603
quadrupole: -0.3597 5.8476 -5.8788
quadrupole: -2.4756 3.4134 -0.9378 -0.3597 5.8476 -5.8788
hfenergy: -827.6000511 hartree
pointgroup: C01 [X(C16H23N1O2)]
dipole: 0.0003779 0.3704857 0.4765951 debye
polarizability: 205.2533312|-8.5827495|166.6962128|-1.689754|-10.9948767|165.6495316 unknown
InChI: InChI=1S/C16H23NO2/c1-4-15(18)19-16(14-8-6-5-7-9-14)10-11-17(3)13(2)12-16/h5-9,13H,4,10-12H2,1-3H3
charge 0 multiplicity 1
42 atoms
O  0.147248 -1.060449 0.798219
O  -0.817246 -1.999434 -1.124407
N  3.233679 0.680876 0.383979
C  0.238834 0.350393 0.203929
C  1.159834 0.338452 -1.039749
C  2.604267 -0.140225 -0.697285
C  0.923011 1.139984 1.350292
C  2.378689 0.649583 1.597273
C  -1.18944 0.858099 -0.040829
C  3.479519 -0.214337 -1.960037
C  3.657373 2.043293 -0.002543
C  -2.147754 0.741813 1.001212
C  -1.580595 1.480628 -1.250734
C  -0.416261 -2.102703 0.056095
C  -3.459324 1.233189 0.838268
C  -2.892499 1.980635 -1.414607
C  -0.459851 -3.365964 0.909027
C  -3.837426 1.861192 -0.371891
C  -1.105978 -4.557464 0.181717
H  1.220137 1.373791 -1.430478
H  0.71981 -0.293682 -1.829439
H  2.530218 -1.165091 -0.278649
H  0.325371 1.039757 2.274659
H  0.918134 2.211157 1.071692
H  2.851867 1.267853 2.382653
H  2.3421 -0.392482 1.965499
H  3.505157 0.746106 -2.507583
H  4.514411 -0.491094 -1.690791
H  3.082793 -0.979925 -2.650752
H  4.426146 1.989517 -0.791737
H  4.118477 2.529277 0.876253
H  2.841406 2.71598 -0.368512
H  -1.865881 0.247651 1.938357
H  -0.87341 1.563641 -2.081285
H  -4.186596 1.127315 1.651393
H  -3.177522 2.454994 -2.360559
H  0.576077 -3.601018 1.222271
H  -1.003182 -3.123217 1.842641
H  -4.855473 2.245481 -0.500931
H  -0.555408 -4.806011 -0.741774
H  -1.113462 -5.447409 0.835878
H  -2.144952 -4.326652 -0.109036
