program: Gaussian 09
title: 000133323
version: EM64L-G09RevD.01
frameworkgroup: C1[X(C19H21NO4)]
method: RPBEPBE
basis: SDD
operation: Freq
keyword: #p
keyword: freq=noraman
keyword: PBEPBE/SDD
title: #p freq=noraman PBEPBE/SDD
converged: YES YES NO NO
title: Mulliken charges:
elementType: O O O O N C C C C C C C C C C C C C C C C C C C H H H H H H H H H H H H H H H H H H H H H
charge: -0.470387 -0.340897 -0.325330 -0.431019 -0.111212 -0.146972 0.060893 -0.678832 0.421015 -0.400843 0.131943 -0.551230 0.445163 0.181036 -0.614548 -0.057059 -0.642087 0.227534 -0.618252 -0.473437 0.180119 0.128605 -0.518663 -0.525586 0.203419 0.244087 0.226129 0.190603 0.212038 0.204707 0.233844 0.248663 0.188337 0.230326 0.223571 0.258807 0.309532 0.386707 0.378698 0.227283 0.240809 0.225898 0.227058 0.232715 0.236817
chargesum: 0.00000
title: Mulliken charges with hydrogens summed into heavy atoms:
elementType: O O O O N C C C C C C C C C C C C C C C C C C C
charge: -0.083681 -0.340897 -0.325330 -0.052322 -0.111212 0.056447 0.060893 -0.208617 0.421015 0.001798 0.131943 -0.112679 0.445163 0.181036 -0.365885 -0.057059 0.000146 0.227534 -0.359444 -0.163904 0.180119 0.128605 0.175327 0.171004
polarizability: 3.29738511e+02 -1.09705316e+01 2.72665861e+02 2.22354680e-01 7.38002153e+00 1.24478782e+02
1716.lowfreq: -7.0189 -2.4648 -0.0010 -0.0006 -0.0004 7.8214 38.7434 45.8500 50.6335
frequency: 38.7120 45.8265 50.6164 76.0614 95.1185 107.1730 123.4173 146.0779 171.4852 175.4175 186.7205 198.6046 207.5281 222.4682 228.7136 263.8142 268.4432 279.8858 288.7123 314.4084 321.5071 331.0787 369.4703 380.7073 387.4527 409.5710 422.8829 446.2188 458.4311 485.8276 498.5322 504.2667 519.1896 533.6606 536.9793 548.5986 595.3416 610.1263 644.4016 655.4551 681.2368 708.3429 727.9136 742.8748 748.0799 768.7679 791.0549 828.4180 839.4058 856.3335 869.2449 880.6664 932.0713 953.4751 983.4479 986.0413 1004.9295 1036.8736 1067.8910 1078.7625 1080.3447 1096.6151 1110.8385 1117.6626 1117.9676 1131.5702 1150.8626 1158.2666 1159.2675 1166.8614 1175.2312 1194.1778 1209.7897 1221.2026 1226.6528 1231.3882 1247.4682 1260.1377 1274.8376 1279.8959 1296.1638 1309.8592 1321.4189 1339.8650 1348.4749 1371.9032 1396.2789 1404.0950 1428.1844 1433.7506 1438.4710 1442.6686 1448.0912 1454.6108 1461.0392 1463.3448 1463.4093 1466.9861 1468.2544 1476.1487 1477.4530 1482.1440 1483.4682 1513.9750 1591.1371 1606.2332 1613.5536 1630.6330 2775.5583 2841.1706 2859.5308 2965.9309 2967.4699 2973.7401 2977.3661 3027.1147 3032.3001 3034.4796 3055.5750 3057.0927 3060.2572 3090.2629 3124.1376 3125.4664 3144.4978 3152.4946 3197.2790 3464.9096 3507.6982
redmass: 3.7136 4.0833 3.3766 3.8839 4.2962 4.7699 4.1846 3.0730 2.3958 2.4212 1.9655 2.6527 1.8112 1.5518 1.4446 2.6460 3.9696 4.1295 2.9213 3.6441 4.1493 5.5272 4.3292 5.5446 4.5200 4.6517 3.8831 2.9132 3.8640 3.7581 1.1088 5.1013 3.1474 1.4547 2.3403 4.4454 5.2608 4.9808 5.6841 6.0800 4.9269 3.0414 3.7446 5.1297 5.7287 4.5409 4.3044 2.1332 2.4920 2.3620 1.5680 1.4525 3.7206 2.4746 2.7897 3.3486 4.5527 2.1454 2.3020 3.7112 2.5636 3.8564 1.3865 1.2552 1.2567 2.7207 1.7848 1.3875 1.4304 1.5609 1.7956 1.4264 1.8338 2.3806 1.5947 1.9750 1.7210 2.6371 2.1158 1.4596 1.4597 1.7860 1.5504 1.6769 3.2900 1.4382 3.4556 4.1397 3.2252 1.2487 1.3792 1.2929 1.2594 1.1741 2.1020 1.0615 1.0516 1.2744 1.6971 1.0968 1.1051 1.2226 1.1503 3.3337 7.1711 7.7725 7.1893 7.2246 1.0778 1.0688 1.0595 1.0324 1.0321 1.0598 1.0646 1.0975 1.0891 1.0753 1.1043 1.1043 1.0956 1.0992 1.1007 1.1002 1.0909 1.0919 1.0909 1.0639 1.0644
irintensity: 1.0370 1.4072 4.3943 4.4676 1.2732 1.9403 1.3369 1.3573 1.1716 2.1097 2.2487 2.7844 0.1993 0.4503 0.7031 1.2799 0.3251 2.9500 10.2300 1.1204 0.5148 2.5720 1.0111 3.4622 0.2570 2.5969 0.8083 5.9680 1.2898 4.8921 142.4329 4.1784 3.3958 95.9340 33.5048 15.3162 17.5931 3.8252 16.2127 0.1509 2.6298 5.7917 0.2240 1.0712 33.1595 0.6421 15.5918 46.5704 31.2629 19.7484 3.1039 45.6224 1.4121 9.8775 3.4713 31.1344 23.1216 3.6631 22.2952 126.6983 48.2837 79.3660 13.9615 0.2008 0.2075 14.6843 3.3163 18.3299 70.2260 29.9877 88.1876 0.7706 1.8473 63.9114 89.6361 95.8283 1.9255 80.2266 20.2049 119.9855 30.6132 103.4192 32.9414 14.8443 95.0030 25.2373 31.9438 11.3880 31.7258 0.5040 21.7966 16.5350 10.8002 20.8669 39.3557 11.5986 17.0801 18.0510 111.4849 71.7141 13.0434 4.9745 26.7665 156.9101 48.5561 34.6607 26.5155 9.7450 48.5580 55.0874 182.3644 68.4563 55.9788 42.0530 22.1711 41.0783 20.9585 77.9329 41.5820 43.1630 37.6027 31.4119 30.2536 24.7167 9.5121 8.0304 9.1784 107.3465 112.5809
temp: 298.150 k
press: 1.00000 atm
elementType: 8 8 8 8 7 6 6 6 6 6 6 6 6 6 6 6 6 6 6 6 6 6 6 6 1 1 1 1 1 1 1 1 1 1 1 1 1 1 1 1 1 1 1 1 1
symmnumber: 1
zpe: 952895.7 jmol-1
zpe.correction: 0.362939 hartree
zpe.thermalcorrener: 0.384853 hartree
zpe.thermalcorrenthalpy: 0.385797 hartree
zpe.thermalcorrgfe: 0.313255 hartree
zpe.sumelectzpe: -1090.487424 hartree
zpe.sumelectthermal: -1090.465510 hartree
zpe.sumelectthermalent: -1090.464566 hartree
zpe.sumelectthermalfe: -1090.537108 hartree
dipole: -3.6415 3.6879 1.4616
dipole: 5.3850
quadrupole: -123.3943 -118.4509 -144.9999
quadrupole: 4.0391 2.8721 -1.0208
quadrupole: 5.5541 10.4975 -16.0516 4.0391 2.8721 -1.0208
hfenergy: -1090.8503632 hartree
pointgroup: C01 [X(C19H21N1O4)]
dipole: -1.2646184 1.5605352 0.6737617 debye
polarizability: 326.6987769|-14.9389968|274.7566638|-12.9823026|9.4869363|125.4277128 unknown
InChI: InChI=1S/C19H21NO4/c1-20-5-4-10-8-16(24-3)19(22)18-12-9-15(23-2)14(21)7-11(12)6-13(20)17(10)18/h7-9,13,21-22H,4-6H2,1-3H3
charge 0 multiplicity 1
45 atoms
O  0.576427 2.790008 -0.240995
O  -1.823032 3.776155 -0.071428
O  4.848162 0.600692 0.060115
O  4.9387 -1.965937 -0.703738
N  -2.323446 -2.739984 0.097584
C  -1.086002 -1.922461 0.229249
C  -1.355953 -0.414517 0.124269
C  -0.029036 -2.299864 -0.832311
C  -2.665535 0.106131 0.210098
C  -3.426951 -2.187389 0.920592
C  -0.216845 0.452969 -0.039793
C  -3.856772 -0.826528 0.359733
C  1.242428 -1.507929 -0.587666
C  1.138455 -0.141366 -0.185249
C  -2.882614 1.507506 0.149195
C  -0.460012 1.849511 -0.082155
C  -2.092768 -4.167906 0.405642
C  -1.783588 2.361975 0.007069
C  2.509506 -2.108145 -0.756575
C  2.335716 0.598573 0.043931
C  3.585682 -0.011921 -0.127028
C  3.684066 -1.371129 -0.533687
C  -3.133447 4.421242 -0.023207
C  4.857303 2.009649 0.45352
H  -0.620005 -2.105534 1.239121
H  -0.454379 -2.079076 -1.832439
H  0.198014 -3.37881 -0.801528
H  -3.127173 -2.079652 1.995708
H  -4.27459 -2.896234 0.883777
H  -4.620796 -0.370664 1.019367
H  -4.329823 -0.989659 -0.628718
H  -3.903242 1.897624 0.218084
H  -1.685177 -4.334567 1.43551
H  -1.391798 -4.618404 -0.315768
H  -3.049249 -4.713244 0.322308
H  2.597745 -3.154871 -1.064297
H  2.260257 1.646413 0.334232
H  0.146209 3.687071 -0.300602
H  5.631842 -1.283135 -0.497795
H  -3.772579 4.081966 -0.860768
H  -2.936443 5.499338 -0.117365
H  -3.639568 4.215214 0.939342
H  4.365993 2.149082 1.435486
H  4.349389 2.634578 -0.30541
H  5.919028 2.28943 0.522787
