program: Gaussian 09
title: 000133315
version: EM64L-G09RevD.01
frameworkgroup: C1[X(C11H12N4O4S2)]
method: RPBEPBE
basis: SDD
operation: Freq
keyword: #p
keyword: freq=noraman
keyword: PBEPBE/SDD
title: #p freq=noraman PBEPBE/SDD
converged: YES YES NO NO
title: Mulliken charges:
elementType: S S O O O O N N N N C C C C C C C C C C C H H H H H H H H H H H H
charge: 0.970260 0.496054 -0.535483 -0.480916 -0.272515 -0.242867 -0.611953 -0.456288 -0.423928 -0.405211 -0.079281 -0.160424 -0.232559 0.504031 -0.338037 -0.426852 0.256135 0.187447 0.231300 -0.777990 -0.494356 0.297262 0.291035 0.363805 0.321502 0.233294 0.308403 0.263986 0.263871 0.214902 0.238598 0.247446 0.249328
chargesum: 0.00000
title: Mulliken charges with hydrogens summed into heavy atoms:
elementType: S S O O O O N N N N C C C C C C C C C C C
charge: 0.970260 0.496054 -0.535483 -0.480916 -0.272515 -0.242867 -0.248148 -0.147885 -0.423928 -0.405211 -0.079281 0.136838 0.058476 0.504031 -0.016534 -0.193558 0.256135 0.187447 0.231300 -0.035230 0.241017
polarizability: 2.97644541e+02 1.52305754e+01 2.16988814e+02 4.28104848e+00 -2.92909494e+01 1.42137952e+02
1716.lowfreq: -6.3744 -4.6113 -0.0008 0.0007 0.0012 1.2486 13.2444 17.5345 32.8378
frequency: 12.8379 17.3830 32.8105 46.5873 57.2836 73.6385 75.6033 91.7341 102.9697 119.9727 139.1258 145.9044 176.2903 184.8686 203.8917 211.8573 222.9243 251.7886 298.3175 310.8655 328.9382 351.4778 381.6053 399.4809 411.6554 424.4015 456.7988 464.4069 491.6308 525.4608 527.5691 547.6947 561.3446 596.5349 618.1255 647.2096 654.0330 674.7823 687.4283 718.3701 728.7315 746.9808 810.6795 824.9832 831.5324 852.6884 856.5638 930.0856 956.6827 963.7767 965.6039 984.1595 989.4561 994.7377 1041.3719 1052.8192 1117.4975 1126.6887 1145.6080 1176.4416 1187.1764 1214.5599 1264.1273 1265.8537 1303.8118 1362.2835 1371.8778 1391.4821 1408.0388 1408.1125 1448.9239 1450.5877 1463.9942 1469.5061 1476.2658 1477.4178 1501.7835 1504.9547 1593.6376 1599.8702 1633.5056 2998.1235 3002.8678 3099.9097 3101.2852 3105.6779 3126.8089 3154.1007 3166.9437 3173.3504 3200.5939 3471.9666 3533.2786
redmass: 5.6435 6.1241 6.5258 1.8527 1.8193 8.7285 4.5139 5.2012 6.0586 4.0278 1.1850 4.8661 8.0126 6.8452 9.0750 7.3384 5.0419 7.7233 6.5603 11.0949 7.9546 5.8302 5.0997 5.2444 2.9586 7.0590 3.3544 10.0467 8.0494 2.8985 3.8505 4.4579 4.6729 3.0661 6.9507 1.2064 3.8768 6.8148 9.1536 11.8626 3.3043 4.4856 10.9618 5.2417 1.3544 5.5834 1.7011 6.2273 11.7915 1.8732 3.5510 3.9289 1.4179 1.6897 1.6400 2.3843 1.2530 1.3313 1.6439 2.0426 1.1360 3.3964 3.1973 1.9004 1.4285 2.7219 3.9767 1.2349 1.9486 3.0758 1.0446 1.0491 1.0534 1.1494 3.2222 2.1113 2.7470 4.6189 6.6095 5.7776 4.8888 1.0363 1.0294 1.0993 1.0992 1.1051 1.0902 1.1051 1.0952 1.0916 1.0955 1.0771 1.0766
irintensity: 3.0525 1.5599 3.3001 1.2736 0.3899 1.3638 5.7024 0.4355 5.1030 3.0986 0.2356 5.5547 2.5632 5.7178 0.5846 4.5971 8.9503 0.7282 9.2690 2.7082 11.1465 46.1540 0.9130 6.0506 0.9625 23.8226 71.1133 26.4881 62.8030 81.9571 33.8267 55.4179 10.3837 1.9233 3.2880 53.3863 125.7183 25.7128 26.4886 6.9067 0.9204 81.6406 87.4440 23.6933 14.2563 45.8711 55.0858 3.3562 55.2367 16.3224 47.3122 7.3028 2.6172 14.7519 15.5585 46.6830 0.0301 9.1247 11.7289 85.4225 29.1431 79.8120 88.5860 86.3713 55.4015 37.4469 253.4745 46.2506 72.6118 5.8881 15.8187 15.4943 31.3549 16.5366 121.3511 51.7820 488.4248 113.8732 106.6676 29.5300 104.3765 10.4051 39.2731 11.7207 11.0813 22.1095 14.0758 15.0366 6.2916 9.1566 9.9662 82.5208 16.0635
temp: 298.150 k
press: 1.00000 atm
elementType: 16 16 8 8 8 8 7 7 7 7 6 6 6 6 6 6 6 6 6 6 6 1 1 1 1 1 1 1 1 1 1 1 1
symmnumber: 1
zpe: 599779.9 jmol-1
zpe.correction: 0.228444 hartree
zpe.thermalcorrener: 0.250368 hartree
zpe.thermalcorrenthalpy: 0.251312 hartree
zpe.thermalcorrgfe: 0.173720 hartree
zpe.sumelectzpe: -1740.644129 hartree
zpe.sumelectthermal: -1740.622205 hartree
zpe.sumelectthermalent: -1740.621261 hartree
zpe.sumelectthermalfe: -1740.698853 hartree
dipole: -2.9229 0.0595 -6.1903
dipole: 6.8460
quadrupole: -84.2242 -153.8754 -138.6080
quadrupole: -10.5250 5.3065 -5.4573
quadrupole: 41.3450 -28.3062 -13.0388 -10.5250 5.3065 -5.4573
hfenergy: -1740.872573 hartree
pointgroup: C01 [X(C11H12N4O4S2)]
dipole: -1.2586163 0.8496963 2.2244978 debye
polarizability: 298.3366809|-9.6964067|184.8502778|7.7663884|-47.3367201|173.5843481 unknown
InChI: InChI=1S/C11H12N4O4S2/c1-7(16)12-8-3-5-9(6-4-8)21(17,18)15-10-11(19-2)14-20-13-10/h3-6,12,15H,1-2H3
charge 0 multiplicity 1
33 atoms
S  1.072078 -1.89063 0.193904
S  2.826093 2.461932 -1.556477
O  1.222396 -3.013697 1.359951
O  1.470448 -2.199196 -1.344291
O  4.663886 0.70206 1.372154
O  -4.82458 1.605703 -1.41058
N  2.162615 -0.514531 0.881963
N  -4.572038 0.314577 0.535682
N  1.855464 1.081105 -0.89615
N  4.19678 2.256824 -0.3984
C  -0.649382 -1.157785 0.276961
C  -1.096742 -0.334883 -0.767925
C  -1.436003 -1.506856 1.387292
C  -3.240325 -0.157764 0.404591
C  -2.410255 0.172055 -0.704512
C  -2.745095 -0.998254 1.442823
C  2.585284 0.547472 0.098575
C  3.88082 1.208275 0.361685
C  -5.29718 1.144617 -0.33338
C  -6.719666 1.45303 0.124696
C  5.963047 1.382036 1.58832
H  -0.434621 -0.083919 -1.601271
H  -1.038842 -2.165229 2.165819
H  2.836129 -0.906635 1.556147
H  -2.800306 0.817795 -1.492312
H  -3.38645 -1.256253 2.294396
H  -5.065884 0.0062 1.376176
H  -7.427116 1.104956 -0.64745
H  -6.839472 2.546962 0.205481
H  -6.99312 0.993079 1.090085
H  6.434187 0.831769 2.414134
H  5.793056 2.438997 1.854741
H  6.572295 1.327986 0.670174
