program: Gaussian 09
title: 000133294
version: EM64L-G09RevD.01
frameworkgroup: C1[X(C13H21N5O3)]
method: RPBEPBE
basis: SDD
operation: Freq
keyword: #p
keyword: freq=noraman
keyword: PBEPBE/SDD
title: #p freq=noraman PBEPBE/SDD
converged: YES YES NO NO
title: Mulliken charges:
elementType: O O O N N N N N C C C C C C C C C C C C C H H H H H H H H H H H H H H H H H H H H H
charge: -0.243964 -0.280365 -0.273625 -0.202831 -0.156624 -0.223403 -0.119003 -0.080757 0.123600 0.088608 0.214091 -0.413519 0.161631 -0.332246 -0.269839 0.210018 -0.613906 -0.615448 -0.602014 -0.625917 -0.614181 0.234348 0.222593 0.175460 0.208704 0.230517 0.225266 0.248927 0.256801 0.257522 0.273034 0.243737 0.243466 0.268252 0.248344 0.248197 0.235851 0.186510 0.223323 0.224915 0.188124 0.225802
chargesum: 0.00000
title: Mulliken charges with hydrogens summed into heavy atoms:
elementType: O O O N N N N N C C C C C C C C C C C C C
charge: -0.243964 -0.280365 -0.273625 -0.202831 -0.156624 -0.223403 -0.119003 -0.080757 0.123600 0.088608 0.214091 0.043423 0.161631 0.051918 0.185944 0.210018 0.149344 0.144789 0.162779 0.019767 0.024661
polarizability: 2.73258021e+02 3.69378040e-01 1.96981568e+02 -1.73750763e+00 3.54914275e-02 1.12564019e+02
1716.lowfreq: -68.2934 -1.5830 -0.0008 -0.0003 0.0007 5.6147 8.4088 19.8715 33.4941
frequency: -68.2923 19.7776 32.8897 38.2289 64.3193 79.8299 87.2355 90.7089 102.7705 116.6589 120.8002 128.8601 131.5256 149.3752 175.8409 204.0864 229.8757 233.6253 243.5656 248.6649 275.6682 304.3084 320.9794 335.3315 345.1257 359.5084 373.5482 388.3972 408.2805 442.0414 450.4687 484.6322 504.7346 568.6567 641.9968 645.1385 684.0938 702.9446 721.2821 733.6135 756.5276 772.4824 802.7901 819.3028 869.4047 919.4357 956.3553 973.4843 1022.9021 1028.8843 1034.3919 1048.0511 1069.6617 1084.1634 1093.5615 1099.5009 1128.3866 1130.0580 1131.9798 1143.3891 1167.0863 1177.0786 1189.9158 1217.0058 1220.1441 1228.6667 1260.9938 1265.8357 1271.1354 1292.7028 1298.3232 1299.9088 1360.8923 1366.4222 1383.4684 1403.8832 1412.9921 1421.1264 1427.2311 1444.7880 1449.2972 1462.5212 1463.7432 1464.4982 1466.8503 1474.0768 1474.2374 1475.9211 1477.9170 1479.0548 1479.4447 1480.4450 1485.0530 1491.1319 1504.2208 1512.5288 1578.6536 1616.9516 1653.8263 2816.4683 2845.4640 2861.8548 2999.9183 3000.7401 3005.2130 3010.5172 3012.8493 3014.6153 3020.8347 3033.3602 3057.9795 3079.1512 3085.9835 3090.8788 3093.6651 3101.5689 3106.9865 3134.2865 3136.5810 3137.1611
redmass: 1.0639 4.3641 2.7086 4.6861 3.5116 1.1258 2.9530 1.9616 3.1136 1.3046 2.8300 3.2585 3.7413 2.7615 4.8607 3.0946 5.3149 1.1612 1.1837 7.2681 2.5589 2.8418 6.7926 2.3363 3.1105 4.1103 8.4417 7.6993 4.9164 4.7896 3.2143 3.8126 5.2819 7.0845 10.7559 5.6479 11.9168 11.3117 7.2387 11.1248 4.8356 1.1398 5.1184 5.5908 1.2243 5.3342 6.0148 3.2134 2.5329 2.6056 1.5466 3.0916 2.4153 2.6483 1.3716 1.5799 1.3060 1.2998 1.3002 1.5538 2.5836 1.4733 3.6049 4.9922 1.7351 2.8109 2.0691 6.8514 1.2809 1.2984 2.8886 1.7255 1.7791 3.2774 1.4314 2.0822 1.3345 1.1435 1.2490 1.1701 2.3764 1.0659 1.1504 1.3194 1.0410 1.1754 1.0704 1.0686 1.0807 1.0429 1.0664 1.1076 1.0678 1.1033 2.4570 2.3556 8.0630 10.8433 10.6366 1.0704 1.0574 1.0573 1.0651 1.0760 1.0337 1.0328 1.0613 1.0331 1.0724 1.0718 1.1053 1.1013 1.1053 1.1019 1.1025 1.1021 1.1024 1.1026 1.1022 1.1009
irintensity: 0.0952 0.3410 0.4786 0.2853 0.2372 0.0528 0.1791 0.4505 1.1814 1.1658 0.9153 11.1448 5.8136 6.2511 1.2691 8.5298 0.8796 2.4293 0.5808 0.0413 0.6664 6.8094 0.0006 6.9629 4.4550 11.9904 0.0047 21.0503 2.4028 5.9750 9.9319 21.1942 21.6363 7.1006 6.5083 7.0051 1.2914 7.1684 13.3592 15.1390 3.4195 4.0433 10.1905 12.4295 0.6541 92.0710 34.5329 157.7047 1.7558 36.6947 15.3227 13.3736 7.3955 57.2832 6.6398 2.4078 0.6072 0.3058 0.0739 6.1571 79.7925 12.8774 39.8342 21.4276 7.5579 3.4539 4.4004 49.0299 0.1692 0.4175 35.4568 1.8798 190.1898 29.1955 76.3024 49.0128 9.0656 3.4495 62.1203 0.8782 585.8781 5.2954 26.1915 18.3397 16.4988 16.0206 18.5557 7.4547 12.6682 16.9369 18.7089 7.2808 1.9400 47.3787 147.2448 200.3629 57.3450 492.6112 504.9932 78.9732 71.8935 216.4361 11.0063 14.5342 39.5809 32.1759 36.0111 21.9034 44.8983 43.9472 0.7849 26.3359 54.4095 46.4225 20.0822 18.7059 13.0086 3.6833 0.8149 0.4390
temp: 298.150 k
press: 1.00000 atm
elementType: 8 8 8 7 7 7 7 7 6 6 6 6 6 6 6 6 6 6 6 6 6 1 1 1 1 1 1 1 1 1 1 1 1 1 1 1 1 1 1 1 1 1
symmnumber: 1
zpe: 899114.2 jmol-1
zpe.correction: 0.342455 hartree
zpe.thermalcorrener: 0.364669 hartree
zpe.thermalcorrenthalpy: 0.365614 hartree
zpe.thermalcorrgfe: 0.289441 hartree
zpe.sumelectzpe: -1005.809174 hartree
zpe.sumelectthermal: -1005.786959 hartree
zpe.sumelectthermalent: -1005.786015 hartree
zpe.sumelectthermalfe: -1005.862187 hartree
dipole: 5.9445 0.3536 0.6662
dipole: 5.9921
quadrupole: -132.0048 -127.7226 -125.1485
quadrupole: 4.9585 5.0614 -1.4919
quadrupole: -3.7128 0.5694 3.1434 4.9585 5.0614 -1.4919
hfenergy: -1006.1516288 hartree
pointgroup: C01 [X(C13H21N5O3)]
dipole: -2.3358701 0.1507517 -0.2806011 debye
polarizability: 273.2753413|-0.4779777|196.9149003|-0.1882102|2.3945399|112.6133667 unknown
InChI: InChI=1S/C13H21N5O3/c1-15(2)7-6-8-21-12-14-10-9(16(12)3)11(19)18(5)13(20)17(10)4/h6-8H2,1-5H3
charge 0 multiplicity 1
42 atoms
O  -1.620563 -0.853556 0.058892
O  3.650258 -2.432733 -0.004094
O  4.792631 2.148349 -0.011191
N  0.675888 -1.453841 0.033961
N  2.507981 1.609753 0.015549
N  4.193889 -0.119012 -0.007366
N  0.174726 0.790905 0.04104
N  -6.453849 0.178915 0.170084
C  1.903216 -0.751523 0.020513
C  1.551775 0.607313 0.025481
C  -0.307735 -0.482187 0.045517
C  -3.995078 -0.365257 0.068855
C  3.258499 -1.223058 0.0029
C  -5.092138 0.71584 -0.055409
C  -2.606954 0.271395 0.06391
C  3.884104 1.268096 -0.001702
C  0.484834 -2.911443 0.035832
C  2.108575 3.029316 0.023935
C  5.638019 -0.445237 -0.025629
C  -6.873037 -0.802185 -0.852511
C  -7.447234 1.262855 0.324328
H  -4.152753 -0.926843 1.007125
H  -4.054362 -1.084508 -0.768306
H  -5.003741 1.218507 -1.056883
H  -4.916348 1.497042 0.710819
H  -2.418193 0.891047 0.959647
H  -2.426234 0.890728 -0.834642
H  -0.596035 -3.117688 0.050388
H  0.940841 -3.357068 -0.86289
H  0.964405 -3.357615 0.921868
H  3.028502 3.631782 0.014615
H  1.516571 3.251508 0.927771
H  1.495267 3.256331 -0.864358
H  5.723592 -1.541741 -0.028856
H  6.134244 -0.020337 0.862319
H  6.112489 -0.016708 -0.923678
H  -6.19947 -1.675423 -0.850462
H  -6.890394 -0.376547 -1.889273
H  -7.888854 -1.164117 -0.614804
H  -8.431677 0.829752 0.575841
H  -7.571065 1.888452 -0.596651
H  -7.146791 1.929141 1.152717
