program: Gaussian 09
title: 000133297
version: EM64L-G09RevD.01
frameworkgroup: C1[X(C14H18N4O2)]
method: RPBEPBE
basis: SDD
operation: Freq
keyword: #p
keyword: freq=noraman
keyword: PBEPBE/SDD
title: #p freq=noraman PBEPBE/SDD
converged: YES YES NO NO
title: Mulliken charges:
elementType: O O N N N N C C C C C C C C C C C C C C H H H H H H H H H H H H H H H H H H
charge: -0.183392 -0.256205 -0.392096 -0.099251 -0.048108 -0.005811 -0.483497 -0.347921 -0.356679 0.358507 0.158468 -0.032970 0.278144 -0.299820 -0.621410 -0.611275 -0.312220 -0.367705 -0.390905 -0.217750 0.209732 0.224244 0.218365 0.246592 0.197203 0.231459 0.333854 0.247298 0.223445 0.191873 0.225737 0.242356 0.218916 0.189080 0.274079 0.274514 0.238066 0.245082
chargesum: 0.00000
title: Mulliken charges with hydrogens summed into heavy atoms:
elementType: O O N N N N C C C C C C C C C C C C C C
charge: -0.183392 -0.256205 -0.058241 -0.099251 -0.048108 -0.005811 -0.049521 0.117035 0.071983 0.358507 0.158468 -0.032970 0.278144 -0.052522 0.019645 0.039078 -0.038141 -0.093191 -0.152839 0.027332
polarizability: 2.73304061e+02 1.31087786e-01 2.35671466e+02 -1.88418554e+01 9.33493010e+00 1.20843673e+02
1716.lowfreq: -10.8168 0.0004 0.0005 0.0007 1.3461 6.1094 15.8357 20.3343 44.7397
frequency: 15.0775 19.6859 44.7262 48.3412 68.1901 99.6566 117.0647 149.9111 174.1261 190.1497 212.6664 228.9393 237.4890 244.4004 268.1003 287.5676 313.1625 344.4176 362.9599 393.6648 403.7151 413.0288 472.0569 477.4523 488.6655 524.4861 531.5108 551.5449 608.0293 627.2546 642.2635 666.8999 694.7020 725.6017 738.1288 762.8336 793.5026 812.3709 823.7660 825.4479 836.7385 894.3603 924.2141 934.9182 958.5343 972.1172 993.2388 995.0572 1035.0532 1038.5409 1065.5771 1082.5007 1089.6178 1099.3107 1111.2097 1125.7189 1139.3290 1150.6734 1180.8755 1189.8361 1204.9838 1218.4521 1230.9916 1266.2659 1270.3335 1289.9338 1310.4827 1330.7517 1334.8707 1345.2619 1357.9652 1368.4963 1380.5432 1399.8441 1419.9317 1421.4812 1439.6799 1444.5423 1458.2820 1464.3950 1466.1412 1472.5353 1477.1926 1481.6598 1487.0987 1494.5617 1540.3978 1562.1157 1578.3486 1601.4138 2844.4951 2850.7017 2869.1782 2952.4499 2993.1955 3015.8930 3020.6311 3021.3874 3024.7281 3054.3672 3078.4617 3082.9417 3125.8168 3154.9348 3175.0902 3186.5176 3187.7411 3397.5466
redmass: 4.9241 4.1683 2.7071 5.1399 7.1338 4.1450 5.6355 4.2878 2.3347 2.7671 2.1032 1.7560 1.2998 4.7446 4.9736 3.9166 2.4988 3.5815 3.7654 2.6537 3.5199 2.0717 4.1395 3.6251 5.5507 6.6804 3.0605 4.4806 2.8902 4.2683 3.6027 2.2757 4.7383 4.3310 2.5430 2.3703 4.6779 2.3295 2.7244 2.0863 1.7425 2.6294 4.2356 1.5073 1.4245 2.3927 2.0183 1.3706 2.7599 1.5087 1.8511 1.7407 1.5039 1.9088 2.9562 2.2143 1.6572 1.4936 2.1862 1.7421 4.1989 1.2869 2.2126 1.7287 2.1518 1.3285 2.0443 3.5037 3.2182 1.6003 1.4679 2.2765 1.3189 3.1657 3.0471 1.1503 2.2763 1.1793 1.0671 1.1335 1.0766 1.0739 1.0661 1.1615 1.1938 1.7843 5.3299 2.1761 5.7177 6.6943 1.0699 1.0573 1.0580 1.0600 1.0668 1.0938 1.0876 1.0740 1.0738 1.0998 1.1007 1.1010 1.0905 1.0875 1.0929 1.0991 1.0927 1.0783
irintensity: 0.3682 0.1447 0.7399 1.5590 0.2713 1.5517 0.4847 3.1581 1.6758 2.1123 0.2263 1.2975 0.7311 2.6317 2.3425 5.4204 12.0278 2.1517 0.5923 0.6364 1.3697 1.4283 3.3809 1.4108 13.0047 2.3163 7.0782 2.3468 22.7283 13.0438 1.2868 41.7241 28.8753 18.5180 27.3565 15.6613 2.0868 8.8632 4.9573 14.3154 57.8559 1.4158 4.2579 1.9162 0.6542 10.0132 35.5001 2.1543 12.5306 12.7224 18.3455 8.8428 9.2117 13.9456 5.5947 5.2318 6.0352 2.3496 66.7151 37.6225 241.6596 6.6739 1.9880 4.8335 10.3585 26.5831 43.4811 48.2228 80.8572 14.3463 1.2191 52.1917 6.1863 83.0829 2.8989 3.6789 9.8550 14.6314 6.7525 24.9978 11.8892 33.8057 8.3334 38.1099 11.9080 11.1537 96.1728 73.8198 275.2168 1.2854 50.3622 98.4301 294.7982 27.7040 21.3814 32.7829 37.6302 23.2459 38.0920 51.3327 23.2483 48.3999 31.9175 5.7840 4.5840 5.5960 11.7912 44.8609
temp: 298.150 k
press: 1.00000 atm
elementType: 8 8 7 7 7 7 6 6 6 6 6 6 6 6 6 6 6 6 6 6 1 1 1 1 1 1 1 1 1 1 1 1 1 1 1 1 1 1
symmnumber: 1
zpe: 803747.0 jmol-1
zpe.correction: 0.306131 hartree
zpe.thermalcorrener: 0.325008 hartree
zpe.thermalcorrenthalpy: 0.325952 hartree
zpe.thermalcorrgfe: 0.256866 hartree
zpe.sumelectzpe: -912.160388 hartree
zpe.sumelectthermal: -912.141511 hartree
zpe.sumelectthermalent: -912.140567 hartree
zpe.sumelectthermalfe: -912.209653 hartree
dipole: 2.0103 1.0419 -0.3349
dipole: 2.2889
quadrupole: -101.6484 -124.3526 -120.7685
quadrupole: 11.6500 -3.5358 -5.5032
quadrupole: 13.9414 -8.7628 -5.1786 11.6500 -3.5358 -5.5032
hfenergy: -912.4665192 hartree
pointgroup: C01 [X(C14H18N4O2)]
dipole: 0.7679913 0.4527757 -0.1269174 debye
polarizability: 273.0838423|2.421254|235.5074813|-19.6732556|10.0780549|121.227876 unknown
InChI: InChI=1S/C14H18N4O2/c1-17(2)10-4-8-15-12-7-9-16-11-5-3-6-13(14(11)12)18(19)20/h3,5-7,9,15H,4,8,10H2,1-2H3
charge 0 multiplicity 1
38 atoms
O  -0.774718 -3.322664 -0.982554
O  0.549018 -2.042335 0.359136
N  0.793473 0.423188 -0.718423
N  4.110727 0.142212 0.725832
N  -2.917238 2.196542 0.482292
N  -0.580045 -2.271228 -0.261465
C  3.11939 0.399529 -1.584467
C  1.952697 1.264024 -1.067101
C  3.711437 -0.556114 -0.517771
C  -0.403766 0.936741 -0.274837
C  -1.575868 0.104468 0.034015
C  -2.805023 0.816651 0.374935
C  -1.706609 -1.332441 -0.056388
C  -0.566891 2.345768 -0.159266
C  5.326059 0.965148 0.570239
C  4.20273 -0.769226 1.885883
C  -4.027034 0.102156 0.598633
C  -2.930814 -2.004093 0.118321
C  -1.802198 2.911847 0.220968
C  -4.100635 -1.283638 0.46013
H  3.906207 1.080901 -1.959537
H  2.786265 -0.204346 -2.451398
H  1.652128 1.988271 -1.84982
H  2.301348 1.83187 -0.178813
H  4.568591 -1.110998 -0.979991
H  2.963772 -1.324616 -0.244467
H  1.005126 -0.549885 -0.466898
H  0.277529 3.008513 -0.356727
H  5.18773 1.71511 -0.2282
H  6.235692 0.360808 0.320369
H  5.525883 1.510199 1.510057
H  3.245533 -1.304609 2.013289
H  4.392848 -0.182683 2.80297
H  5.017509 -1.531068 1.790807
H  -4.896995 0.709693 0.864161
H  -2.949839 -3.091892 0.01253
H  -1.89498 4.000291 0.316656
H  -5.042045 -1.816991 0.6210
