program: Gaussian 09
title: 000133388
version: EM64L-G09RevD.01
frameworkgroup: C1[X(C26H19N3O9)]
method: RPBEPBE
basis: SDD
operation: Freq
keyword: #p
keyword: freq=noraman
keyword: PBEPBE/SDD
title: #p freq=noraman PBEPBE/SDD
converged: YES YES NO NO
title: Mulliken charges:
elementType: O O O O O O O O O N N N C C C C C C C C C C C C C C C C C C C C C C C C C C H H H H H H H H H H H H H H H H H H H
charge: -0.248073 -0.295893 -0.234069 -0.198037 -0.281873 -0.445296 -0.218335 -0.211443 -0.211823 -0.295792 -0.006584 0.002111 0.131485 0.309246 0.054114 0.330466 -0.040893 0.234855 -0.394781 -0.338998 -0.214004 0.161741 0.184208 0.259652 -0.364370 -0.326811 -0.044039 -0.199932 -0.787351 0.340728 0.087245 0.274335 -0.318930 -0.373861 -0.139480 -0.771241 0.277215 -0.746177 0.262672 0.280896 0.237024 0.262069 0.279082 0.238681 0.324361 0.246310 0.236107 0.262016 0.245694 0.234095 0.315255 0.234467 0.246343 0.383230 0.248194 0.243775 0.280416
chargesum: 0.00000
title: Mulliken charges with hydrogens summed into heavy atoms:
elementType: O O O O O O O O O N N N C C C C C C C C C C C C C C C C C C C C C C C C C C
charge: -0.248073 -0.295893 -0.234069 -0.198037 -0.281873 -0.062066 -0.218335 -0.211443 -0.211823 -0.295792 -0.006584 0.002111 0.131485 0.309246 0.054114 0.330466 -0.040893 0.234855 -0.132109 -0.058102 0.023021 0.161741 0.184208 0.259652 -0.102301 -0.047730 -0.044039 0.038749 0.019427 0.340728 0.087245 0.274335 -0.056914 -0.128168 0.094616 0.024824 0.277215 0.026208
polarizability: 4.42824111e+02 -5.65286621e+01 3.38631926e+02 1.36064225e+01 3.75023332e+01 2.67785329e+02
1716.lowfreq: -6.1637 -0.0006 0.0006 0.0009 2.5330 4.2264 13.6826 16.4702 20.0991
frequency: 13.2839 16.1993 20.0327 21.4413 28.2170 39.7400 45.8886 53.5492 62.1474 64.7546 71.2012 74.8783 83.9187 98.6526 110.2457 113.6762 116.7286 123.5026 129.3047 131.8010 140.2241 156.8107 162.7715 178.7726 183.1967 204.2708 217.1021 234.6546 257.6409 264.8132 273.2316 300.9429 303.7129 319.3252 346.5045 347.1168 359.4238 372.4270 402.0752 410.3951 411.5144 441.2518 473.0861 480.2881 485.6641 507.9758 519.6409 524.1141 541.0323 542.8368 553.5599 556.1059 558.2296 570.3081 583.0567 595.3359 604.8082 606.5315 625.2541 634.7783 652.1472 661.3000 671.4435 685.8433 703.5295 716.6074 717.8741 732.5446 754.3208 757.1022 762.0943 792.3865 804.7472 813.2964 819.5071 833.8492 843.3286 859.5196 884.1246 898.4587 908.3879 916.2115 926.8875 929.2849 967.9872 978.8465 981.5485 985.0991 990.4070 993.1218 1001.8620 1033.6678 1039.2289 1045.1273 1047.1206 1051.9314 1054.5963 1062.3535 1076.2510 1087.6971 1121.4390 1150.4590 1160.2859 1168.7510 1178.4349 1182.4437 1186.1850 1207.2453 1209.4435 1225.1479 1236.0404 1239.3229 1246.4671 1271.4263 1289.6423 1311.2694 1326.9563 1372.6016 1382.1854 1385.5255 1386.6048 1388.3795 1413.9412 1420.1872 1424.8506 1438.8114 1448.5738 1449.9159 1451.4831 1451.7504 1452.7283 1458.3152 1461.1456 1472.4087 1544.7666 1548.1473 1564.6849 1577.0712 1582.0261 1596.3647 1610.1394 1621.5368 1649.2100 1651.3262 1676.7700 1683.1908 2986.7860 3005.9233 3006.0752 3079.3773 3099.3357 3100.4078 3133.0801 3138.7945 3142.2033 3144.5901 3151.0967 3153.8244 3159.0976 3173.9687 3178.8181 3178.9129 3188.4177 3199.5918 3529.6609
redmass: 6.1568 6.5961 8.4019 6.7892 7.9265 5.1613 9.7332 5.0349 5.4639 6.9454 6.2634 4.9830 3.3337 4.3477 1.1954 3.4960 2.1589 1.9681 6.9255 4.3542 5.3189 1.3199 4.3381 5.6930 6.0501 7.6010 7.4834 5.7518 5.7022 6.4772 5.9041 5.1497 4.4435 5.8670 4.8610 7.7538 4.7157 7.2289 7.2388 5.0576 6.3824 5.2492 5.1584 4.7005 5.9449 4.6001 4.4169 4.3079 3.7629 3.9224 3.9004 4.0168 2.5438 5.1631 5.2828 5.0462 4.9766 1.6276 5.4800 5.5371 5.8979 6.1531 5.7556 7.5598 6.3041 7.1445 6.4632 3.3925 3.9306 5.9433 2.0921 2.7035 2.0220 2.3935 2.2625 8.5542 5.4073 8.1708 7.3640 7.3275 1.5116 7.1793 1.4072 1.4016 3.9496 1.3893 1.3511 1.3466 2.2017 2.0646 2.9989 3.2147 1.6617 1.8494 2.3044 1.7112 2.3977 3.0384 2.3746 2.6157 1.9485 2.9032 1.4070 3.1796 2.1037 1.4876 2.1136 3.9775 3.9987 2.2375 2.3895 2.1409 2.3252 3.5537 5.3691 2.6941 7.4354 10.6754 1.2324 1.2497 2.4836 1.2414 2.0788 6.8518 2.8365 2.5064 1.0764 1.0617 1.1173 1.0886 1.0805 2.6494 1.0566 3.0125 9.1481 6.5972 10.3093 6.9731 7.8127 8.1016 8.1850 8.3811 8.9403 9.4723 10.6209 10.1999 1.0383 1.0383 1.0367 1.0957 1.0956 1.0941 1.1000 1.0883 1.1022 1.1025 1.0880 1.0881 1.0924 1.0955 1.0998 1.0937 1.0975 1.0959 1.0642
irintensity: 1.2907 1.9145 1.9138 0.6206 1.0104 5.1226 2.4842 2.3441 3.6361 1.0482 0.4757 1.5090 3.1675 2.6637 1.8270 3.7627 2.1745 1.4150 0.6388 1.6474 3.4198 0.2056 2.7462 0.1771 3.5541 1.2120 1.7820 0.7712 0.2667 3.3756 6.9548 0.8754 1.3779 1.6802 3.7120 4.0550 4.2414 5.0565 2.0460 5.5858 2.2654 1.1269 1.2957 10.1618 4.8274 2.6118 9.5096 4.8279 5.6956 3.4379 2.4326 11.6836 36.9182 27.9281 3.3400 12.5107 26.9618 114.2988 17.3102 9.0217 20.4324 6.9859 7.8349 4.4008 13.3774 24.9224 23.3431 18.9004 0.5744 14.9257 61.2885 26.3547 37.8267 19.9534 58.6247 31.8325 12.6698 8.5322 87.1257 173.6512 6.5856 119.1731 1.1410 0.5138 8.3149 1.4989 1.7322 2.2634 43.8132 146.8866 14.5866 216.7740 13.6606 45.4264 3.1175 18.6704 49.7118 30.8338 28.6809 40.0195 18.3823 205.4687 43.7476 732.3528 17.7576 4.1711 42.9762 78.9600 252.9300 0.9351 24.8161 13.8312 35.8382 38.5346 162.2150 92.4694 43.8942 8.7465 80.8044 50.8777 39.7914 79.9222 29.8841 13.8590 35.9811 60.0487 21.0719 19.3889 31.4176 11.5484 24.5652 80.5455 23.8295 24.8130 107.0803 6.0373 69.4199 5.3432 58.1778 8.8684 13.4365 1.0490 226.4113 206.9333 174.7948 187.3632 15.0094 0.9093 16.0167 13.1639 3.6365 8.3521 10.0636 5.4374 12.5248 7.1565 8.4147 6.2523 16.9827 7.4738 14.1273 1.6730 7.2535 0.9575 48.1270
temp: 298.150 k
press: 1.00000 atm
elementType: 8 8 8 8 8 8 8 8 8 7 7 7 6 6 6 6 6 6 6 6 6 6 6 6 6 6 6 6 6 6 6 6 6 6 6 6 6 6 1 1 1 1 1 1 1 1 1 1 1 1 1 1 1 1 1 1 1
symmnumber: 1
zpe: 1059515.5 jmol-1
zpe.correction: 0.403548 hartree
zpe.thermalcorrener: 0.438583 hartree
zpe.thermalcorrenthalpy: 0.439527 hartree
zpe.thermalcorrgfe: 0.331996 hartree
zpe.sumelectzpe: -1840.788098 hartree
zpe.sumelectthermal: -1840.753063 hartree
zpe.sumelectthermalent: -1840.752119 hartree
zpe.sumelectthermalfe: -1840.859650 hartree
dipole: -2.9086 0.3881 -1.8385
dipole: 3.4627
quadrupole: -187.2948 -183.7567 -213.1596
quadrupole: 1.6995 5.1100 -2.8075
quadrupole: 7.4423 10.9803 -18.4226 1.6995 5.1100 -2.8075
hfenergy: -1841.191646 hartree
pointgroup: C01 [X(C26H19N3O9)]
dipole: 1.2228183 -0.0369329 0.5994522 debye
polarizability: 461.7633844|16.7708577|303.1675082|-21.6794486|-47.8378975|284.3104732 unknown
InChI: InChI=1S/C26H19N3O9/c1-13(30)29(25(33)22-19(36-14(2)31)11-6-12-27-22)23-17(8-5-10-20(23)37-15(3)32)24-28-21-16(26(34)35)7-4-9-18(21)38-24/h4-12,34H,1-3H3
charge 0 multiplicity 1
57 atoms
O  1.821258 -2.311081 1.861958
O  -3.53781 -0.901209 -0.702287
O  -1.26018 0.848972 1.630599
O  -1.143542 1.189188 -2.439314
O  -1.722423 3.75894 1.279848
O  5.509529 -0.175803 -2.363107
O  3.305638 -0.769748 -2.789175
O  -5.409937 -0.876199 0.728194
O  -3.350806 2.576102 0.076789
N  -0.9549 -0.104638 -0.482001
N  1.720913 -1.502757 -0.313215
N  0.957262 2.089784 -0.743278
C  -1.343376 -1.370363 0.105744
C  -0.420846 -2.196377 0.805947
C  1.017504 -1.952353 0.718109
C  -2.717544 -1.718289 0.110291
C  3.069366 -1.527526 0.104346
C  3.134483 -2.016769 1.442647
C  -0.897973 -3.307226 1.54927
C  -3.191743 -2.840835 0.82207
C  -2.271342 -3.617854 1.55829
C  4.267609 -1.160406 -0.564686
C  -0.870824 0.974276 0.432493
C  -0.915218 0.071409 -1.927263
C  4.318878 -2.150789 2.173392
C  5.477902 -1.281095 0.167976
C  -0.197263 2.241473 -0.02883
C  5.503734 -1.763584 1.501204
C  -0.544194 -1.162153 -2.716254
C  -0.645339 3.526077 0.387267
C  4.257317 -0.705596 -1.979122
C  -4.858351 -0.494058 -0.317872
C  0.08381 4.669408 -0.00127
C  1.663781 3.191859 -1.099409
C  1.255678 4.50543 -0.765535
C  -5.385933 0.452047 -1.360979
C  -2.996009 3.143007 1.124219
C  -3.778785 3.291267 2.400828
H  -0.182474 -3.926117 2.097956
H  -4.25616 -3.081313 0.820319
H  -2.631129 -4.478619 2.1307
H  4.329354 -2.526261 3.199779
H  6.409636 -0.995401 -0.326497
H  6.463131 -1.841564 2.022088
H  0.521337 -1.383621 -2.51468
H  -0.690149 -0.956429 -3.786477
H  -1.136142 -2.045885 -2.422061
H  -0.272434 5.655768 0.309472
H  2.581823 3.009626 -1.668251
H  1.845124 5.369864 -1.085805
H  -4.844361 1.409433 -1.255549
H  -6.463205 0.613087 -1.210049
H  -5.187591 0.066624 -2.374315
H  5.453629 0.084205 -3.321628
H  -3.609321 4.278022 2.859729
H  -4.849352 3.12606 2.211544
H  -3.416036 2.52259 3.10834
