program: Gaussian 09
title: 000133251
version: EM64L-G09RevD.01
frameworkgroup: C1[X(C12H16N2O3)]
method: RPBEPBE
basis: SDD
operation: Freq
keyword: #p
keyword: freq=noraman
keyword: PBEPBE/SDD
title: #p freq=noraman PBEPBE/SDD
converged: YES YES NO NO
title: Mulliken charges:
elementType: O O O N N C C C C C C C C C C C C H H H H H H H H H H H H H H H H
charge: -0.304399 -0.305989 -0.494098 -0.655517 -0.129592 -0.207784 -0.572646 -0.586083 0.336188 0.345130 0.219677 -0.576553 -0.576669 0.213610 0.215059 -0.530570 -0.529680 0.236749 0.228407 0.228728 0.267271 0.221382 0.261256 0.263617 0.310047 0.354069 0.226132 0.254441 0.218692 0.222442 0.225896 0.252051 0.368743
chargesum: 0.00000
title: Mulliken charges with hydrogens summed into heavy atoms:
elementType: O O O N N C C C C C C C C C C C C
charge: -0.304399 -0.305989 -0.125356 0.008598 -0.129592 0.028964 -0.115512 -0.097430 0.336188 0.345130 0.219677 -0.315297 -0.313053 0.213610 0.215059 0.168695 0.170709
polarizability: 1.96630173e+02 -9.08022840e+00 1.52379708e+02 7.76730361e+00 7.51649547e+00 1.14485190e+02
1716.lowfreq: -9.7948 -0.0003 0.0001 0.0005 2.6093 7.7139 21.1613 34.4604 64.6119
frequency: 21.0117 34.4407 64.5440 71.6808 105.9337 138.0560 154.8986 165.6007 172.6254 199.5789 222.2142 241.4410 271.5807 279.8940 290.0561 321.7502 331.5662 350.3526 377.8950 383.4349 407.7914 441.8809 475.6721 496.9907 541.3157 579.5936 609.8686 628.1700 657.1379 706.4182 708.4025 740.9898 749.3698 784.9041 821.0899 851.8118 878.6960 886.8712 908.5408 925.3352 945.4113 955.0328 1015.9691 1032.7647 1054.7217 1073.3220 1114.4748 1116.1491 1131.1631 1142.1929 1156.3259 1160.0309 1170.5477 1182.5911 1193.5857 1232.3737 1254.9191 1273.4427 1289.5649 1298.9509 1303.0162 1366.2405 1393.0014 1398.4345 1426.2353 1447.5423 1450.0984 1457.5305 1457.8361 1459.1047 1479.1520 1483.4970 1488.5786 1580.6959 1582.4687 1622.2565 1629.1938 2968.3190 2970.5135 2971.1479 2981.2556 3001.2108 3041.0668 3064.9787 3066.8490 3069.9006 3117.0526 3117.5370 3146.0597 3150.5422 3546.1164 3611.4722 3699.4755
redmass: 5.4150 4.4371 4.0003 3.4088 2.6937 2.7332 1.7417 1.6868 1.2089 4.1385 3.8898 3.1903 4.6783 4.1366 3.3099 1.1932 3.5984 2.2562 1.7599 4.7229 3.8856 2.7585 4.6574 3.8235 2.5225 1.6984 3.3692 4.1676 3.2364 6.0872 6.0155 4.0059 3.9512 3.3195 3.3822 8.6767 1.5217 1.5170 3.1957 2.5976 2.7068 5.0364 2.0773 2.4635 1.9347 3.5888 1.2464 1.2437 2.3111 1.4128 1.3127 1.4215 1.3462 1.1625 1.5085 1.4018 1.4405 1.9080 1.4702 2.4143 1.8815 5.3013 2.9053 3.9779 1.1956 1.2842 1.2044 1.1407 1.0738 1.0710 1.0576 3.0818 1.0525 7.9841 1.4306 7.6645 3.3121 1.0312 1.0365 1.0608 1.0682 1.0802 1.0977 1.1031 1.1036 1.0949 1.1028 1.1026 1.0921 1.0924 1.0444 1.0679 1.1040
irintensity: 0.1529 2.0594 1.0335 3.8430 6.8127 4.8063 0.4148 0.1651 1.6192 4.5426 3.5183 4.2833 6.5748 6.9020 1.3693 172.3030 7.0317 101.5485 95.1448 1.2309 6.9208 9.8010 7.3293 6.3346 36.1453 42.4183 18.3256 17.2029 19.9955 3.3034 4.6777 0.7312 8.2626 8.3042 2.8969 73.2110 1.1993 33.1557 19.4903 26.2875 20.1212 74.0261 6.5724 2.8601 86.8259 16.4899 18.3316 2.3096 17.1863 26.9129 3.9305 13.7051 14.3705 15.1059 15.5047 3.5081 85.0836 67.7189 9.4313 4.1324 43.0205 50.5207 2.3680 19.8039 1.0751 9.5774 21.6865 11.4895 10.6597 2.1566 4.8532 122.7565 21.5670 2.0221 61.2969 1.7467 187.4782 93.5716 67.1714 14.9731 31.0170 77.6515 20.0415 30.3423 24.6104 3.1178 24.8694 29.1424 8.4224 1.6700 47.9529 44.4214 35.6749
temp: 298.150 k
press: 1.00000 atm
elementType: 8 8 8 7 7 6 6 6 6 6 6 6 6 6 6 6 6 1 1 1 1 1 1 1 1 1 1 1 1 1 1 1 1
symmnumber: 1
zpe: 695875.6 jmol-1
zpe.correction: 0.265045 hartree
zpe.thermalcorrener: 0.282446 hartree
zpe.thermalcorrenthalpy: 0.283390 hartree
zpe.thermalcorrgfe: 0.219261 hartree
zpe.sumelectzpe: -800.694886 hartree
zpe.sumelectthermal: -800.677486 hartree
zpe.sumelectthermalent: -800.676541 hartree
zpe.sumelectthermalfe: -800.740670 hartree
dipole: 0.8886 -1.7720 -0.1118
dipole: 1.9855
quadrupole: -87.5797 -87.4563 -101.4103
quadrupole: -7.3246 0.1978 -3.6689
quadrupole: 4.5691 4.6925 -9.2615 -7.3246 0.1978 -3.6689
hfenergy: -800.9599314 hartree
pointgroup: C01 [X(C12H16N2O3)]
dipole: 0.3811486 0.6810324 0.0331203 debye
polarizability: 197.3882661|6.8821073|151.8932236|-7.4214818|7.2495841|114.2135812 unknown
InChI: InChI=1S/C12H16N2O3/c1-16-10-5-7-3-9(12(13)14-15)4-8(7)6-11(10)17-2/h5-6,9,15H,3-4,13H2,1-2H3
charge 0 multiplicity 1
33 atoms
O  -3.186288 1.047357 1.103143
O  -3.230119 -1.334613 -0.575816
O  4.186807 -1.927264 1.314784
N  4.308144 0.575746 0.845541
N  3.242738 -1.471365 0.242199
C  2.57877 0.58374 -0.945687
C  1.649827 1.673179 -0.282159
C  1.6054 -0.349048 -1.7385
C  0.284491 1.003793 -0.230064
C  0.259334 -0.141656 -1.063298
C  3.406063 -0.160357 0.099293
C  -0.865774 1.401739 0.477948
C  -0.911566 -0.915721 -1.172453
C  -2.049899 0.639638 0.358687
C  -2.063497 -0.537865 -0.446625
C  -4.355407 1.425455 0.276217
C  -3.646687 -2.009129 0.675462
H  3.300582 1.068656 -1.632488
H  1.614208 2.580096 -0.919323
H  2.009953 1.987123 0.714572
H  1.941989 -1.398458 -1.705016
H  1.563167 -0.037972 -2.801308
H  -0.882453 2.289443 1.119168
H  -0.957442 -1.821335 -1.786183
H  4.430863 1.572988 0.70238
H  4.861435 0.080736 1.542954
H  -5.154973 1.670805 0.992227
H  -4.662246 0.590034 -0.378601
H  -4.115159 2.314523 -0.338036
H  -2.862286 -2.717202 1.004341
H  -4.565776 -2.559329 0.421109
H  -3.843958 -1.271716 1.474606
H  3.978959 -2.892019 1.367124
