program: Gaussian 09
title: 000133325
version: EM64L-G09RevD.01
frameworkgroup: C1[X(C29H22O6)]
method: RPBEPBE
basis: SDD
operation: Freq
keyword: #pfreq=noraman
keyword: PBEPBE/SDD
title: #p freq=noraman PBEPBE/SDD
converged: YES YES NO NO
title: Mulliken charges:
elementType: O O O O O O C C C C C C C C C C C C C C C C C C C C C C C C C C C C C H H H H H H H H H H H H H H H H H H H H H H
charge: -0.294175 -0.283940 -0.283279 -0.454540 -0.245641 -0.414995 -0.231886 -0.235646 -0.214913 0.489752 -0.170883 0.294592 0.221698 -0.570893 0.466365 0.472013 -0.397142 0.020209 -0.396561 0.210121 0.263453 -0.420357 -0.393269 -0.423276 -0.392644 -0.338529 -0.510670 -0.226260 -0.228174 -0.225728 -0.228765 0.336921 -0.411942 -0.238217 -0.237806 0.262609 0.261585 0.248376 0.251642 0.280347 0.246380 0.251507 0.238601 0.259264 0.238088 0.258933 0.275590 0.285362 0.374646 0.227724 0.226380 0.227703 0.226906 0.230762 0.229096 0.229289 0.364222
chargesum: 0.00000
title: Mulliken charges with hydrogens summed into heavy atoms:
elementType: O O O O O O C C C C C C C C C C C C C C C C C C C C C C C C C C C C C
charge: -0.294175 -0.283940 -0.283279 -0.079894 -0.245641 -0.050773 0.030723 0.025938 0.033463 0.489752 0.080759 0.294592 0.221698 -0.290546 0.466365 0.472013 -0.150762 0.020209 -0.145054 0.210121 0.263453 -0.181757 -0.134005 -0.185188 -0.133711 -0.062939 -0.225307 0.001464 -0.001794 0.001975 -0.001859 0.336921 -0.181181 -0.009121 -0.008518
polarizability: 4.80295555e+02 -1.29481613e+01 3.57059286e+02 9.76561719e+00 -3.67018910e+01 2.01986810e+02
1716.lowfreq: -2.8221 -1.3026 -0.0012 -0.0007 0.0009 4.6464 9.9612 18.0567 27.4822
frequency: 8.9113 18.0393 27.4690 36.4127 38.8557 48.0588 50.1911 60.8224 69.1815 74.3642 103.6790 117.7788 138.8481 156.9791 192.1429 212.3861 225.8719 227.6059 233.8586 246.1275 258.1123 267.5003 296.0462 306.9350 317.7723 335.7705 345.8614 382.0679 395.9547 398.3324 402.4678 403.6455 408.1955 449.9769 453.2308 459.5244 480.8389 484.5201 497.3206 514.3889 536.0721 555.4706 568.5575 574.6078 585.9655 603.4311 615.4961 616.1960 619.9280 629.6867 638.2170 654.5534 678.7810 703.5224 704.4107 719.6153 730.8530 732.1498 751.7843 764.8655 767.0464 791.2293 798.5889 817.1861 842.6945 852.2827 855.2238 857.2320 867.4875 870.6673 895.5710 903.2099 915.9337 921.0772 934.6180 947.2061 957.4126 959.4584 968.7886 972.8636 979.5358 979.6999 987.8533 990.8653 990.9913 996.3357 998.1926 1019.0708 1027.2426 1031.8143 1049.0592 1065.9355 1080.9977 1086.3148 1106.1540 1108.4087 1136.9929 1149.0917 1172.9469 1173.0108 1180.2846 1186.6156 1187.3110 1195.9877 1199.1323 1201.3946 1212.2759 1220.4143 1243.2183 1243.4717 1252.9181 1253.9020 1267.3875 1282.7134 1289.5836 1300.2167 1313.5063 1322.9326 1324.5509 1331.0862 1339.8927 1375.7213 1386.1725 1387.1777 1396.2281 1404.8964 1427.5103 1440.7043 1442.8258 1450.9802 1484.9839 1485.6084 1492.6571 1494.0482 1567.4589 1577.6012 1591.0890 1595.4438 1596.0005 1616.1776 1617.1665 1625.0480 1636.2125 2936.7363 2979.5536 2990.7100 2995.5749 3122.5052 3122.9570 3129.4858 3129.7750 3130.1591 3142.6840 3142.7872 3151.0254 3155.1620 3155.5035 3161.5380 3166.8353 3167.0236 3170.8669 3174.2579 3190.3421 3393.0387 3579.8927
redmass: 6.9496 6.3742 6.4048 3.8071 4.0864 4.7519 5.9145 5.7229 7.6022 6.1704 6.9714 7.5764 6.4146 5.4355 6.2074 5.5807 6.0577 4.7088 5.9275 6.3766 5.9154 6.7128 5.2777 5.9862 5.6649 7.1662 6.8845 5.0677 1.1514 4.1110 2.8270 2.8373 4.9469 3.0824 3.2541 5.0118 1.5115 4.3220 3.5875 4.1448 5.3229 5.5216 5.4847 5.4293 5.9896 6.5585 6.4122 6.4045 4.9299 5.0605 4.1974 6.1825 5.4452 1.8212 1.7785 4.2962 5.8337 3.8850 2.8957 2.6070 2.0772 2.8426 1.9198 1.5224 3.6981 2.4693 1.2484 1.5480 4.7102 1.5828 2.9389 2.0545 2.0999 1.4500 2.6902 1.3736 2.3842 3.7403 2.0716 4.7942 1.4179 1.4372 3.5923 5.6144 5.4109 1.3592 1.3432 3.9447 2.1220 2.3935 3.6734 4.2020 1.6295 1.5936 2.8399 1.8627 1.3717 1.6026 1.0558 1.0545 1.6167 1.1135 1.1131 1.5467 1.3963 1.6948 1.8150 1.6490 1.4811 1.5780 1.6165 1.6321 2.4180 1.8830 1.6497 1.7263 1.2436 1.6165 1.8031 1.3185 1.4186 1.8864 7.9428 6.9520 4.8015 5.7295 3.8892 2.1890 2.2068 4.1728 2.3703 2.4125 3.3736 3.4509 7.6760 10.3582 7.8846 6.2010 6.3908 6.1514 6.1156 7.1954 6.8828 1.0803 1.0835 1.0856 1.0869 1.0859 1.0857 1.0878 1.0880 1.0892 1.0923 1.0924 1.0880 1.0959 1.0958 1.0959 1.1011 1.1010 1.0946 1.0942 1.0929 1.0641 1.0661
irintensity: 0.2480 0.5692 0.9325 0.2346 0.2623 0.1061 0.3445 1.2507 0.2036 1.4802 1.7317 2.9202 0.3284 1.4909 1.8670 3.9859 0.2322 0.2432 3.9153 1.8500 1.8744 1.6859 1.9468 22.5241 12.1613 3.6308 10.1516 8.3456 130.0908 3.8012 0.8754 0.3859 7.7581 9.2327 37.0516 1.4429 61.4889 23.7321 2.8872 9.9928 17.1907 12.2744 8.2894 17.6399 6.2215 11.3339 0.4005 0.4443 10.0127 12.7455 6.7937 10.0504 4.1423 42.8245 58.9651 0.9407 7.2627 1.8185 5.7061 60.9398 77.3447 54.7664 27.0731 22.3846 11.6191 15.8845 0.0463 6.5803 6.8306 37.0866 11.9018 15.6103 15.3677 1.0150 51.2162 2.5621 63.5357 81.6119 5.7049 257.1321 0.3441 0.0553 80.4327 0.6738 0.3237 1.7580 1.9003 8.3960 6.6627 21.8009 25.9734 143.2706 17.4601 0.6502 27.0599 308.7396 61.3731 15.3341 0.0784 0.6902 88.8424 2.7382 3.6096 23.2895 14.2413 2.0752 3.9496 11.5690 5.0062 58.2781 175.3186 93.0534 181.3393 2.4638 30.6267 53.5953 78.5746 3.5075 174.6890 8.7072 14.9590 99.1994 0.1028 0.7978 14.1752 106.0212 36.4214 5.7595 14.1217 161.7690 13.9230 16.1939 98.4477 92.1028 48.7689 321.9570 37.7211 1.4205 6.5209 2.2211 1.2832 3.4425 367.8977 17.1671 7.9340 25.3403 28.7867 2.6475 4.3234 1.9747 0.7519 10.0197 3.3478 45.4155 6.0000 27.9688 28.1846 6.7393 18.6920 17.5112 4.7814 1.3086 0.2405 45.2628 79.3821
temp: 298.150 k
press: 1.00000 atm
elementType: 8 8 8 8 8 8 6 6 6 6 6 6 6 6 6 6 6 6 6 6 6 6 6 6 6 6 6 6 6 6 6 6 6 6 6 1 1 1 1 1 1 1 1 1 1 1 1 1 1 1 1 1 1 1 1 1 1
symmnumber: 1
zpe: 1140552.1 jmol-1
zpe.correction: 0.434413 hartree
zpe.thermalcorrener: 0.463049 hartree
zpe.thermalcorrenthalpy: 0.463993 hartree
zpe.thermalcorrgfe: 0.371876 hartree
zpe.sumelectzpe: -1567.180462 hartree
zpe.sumelectthermal: -1567.151827 hartree
zpe.sumelectthermalent: -1567.150882 hartree
zpe.sumelectthermalfe: -1567.242999 hartree
dipole: -0.2817 3.5719 -0.4607
dipole: 3.6124
quadrupole: -142.1959 -197.1318 -202.5785
quadrupole: -18.2951 8.7757 -0.6270
quadrupole: 38.4395 -16.4964 -21.9432 -18.2951 8.7757 -0.6270
hfenergy: -1567.6148755 hartree
pointgroup: C01 [X(C29H22O6)]
dipole: -0.1249972 1.3441946 -0.4443602 debye
polarizability: 480.7679426|-11.564966|337.513707|7.0659203|-62.8718316|221.0600007 unknown
InChI: InChI=1S/C29H22O6/c30-20-12-13-21-23(16-20)34-27(26(32)25(21)31)19-11-14-22-24(15-19)35-29(18-9-5-2-6-10-18)28(33-22)17-7-3-1-4-8-17/h1-16,26-30,32H
charge 0 multiplicity 1
57 atoms
O  1.328935 0.709282 0.107736
O  2.485797 -1.90629 -0.419757
O  -3.568607 0.135623 -0.530085
O  -3.477663 -2.83732 1.760849
O  -6.037203 -2.034904 2.03955
O  -6.98967 3.2514 -1.671408
C  2.763696 0.429468 0.379524
C  3.269148 -0.658289 -0.62624
C  -3.218591 -1.257563 -0.094936
C  -1.715039 -1.39617 -0.192724
C  -3.780976 -1.487944 1.332864
C  0.526281 -0.437186 -0.074017
C  1.091779 -1.713781 -0.324512
C  -0.87018 -0.278892 -0.012685
C  3.500058 1.746771 0.250627
C  4.727496 -1.016583 -0.432534
C  -1.147603 -2.675384 -0.422054
C  -5.306797 -1.258898 1.343459
C  0.250369 -2.832523 -0.485672
C  -5.789557 -0.135301 0.540781
C  -4.88764 0.544458 -0.341278
C  4.573921 2.053503 1.120029
C  3.139162 2.670088 -0.762159
C  5.720395 -0.4387 -1.258805
C  5.113051 -1.907686 0.599929
C  -7.128936 0.331778 0.641314
C  -5.304675 1.675821 -1.067954
C  5.286977 3.264025 0.97505
C  3.849793 3.882132 -0.904901
C  7.085091 -0.737726 -1.051665
C  6.477298 -2.209966 0.804652
C  -6.632802 2.124987 -0.926938
C  -7.561037 1.451591 -0.077663
C  4.927565 4.181815 -0.039134
C  7.467702 -1.623634 -0.018006
H  2.859345 0.014233 1.403527
H  3.080308 -0.283997 -1.653059
H  -3.722074 -1.965658 -0.784774
H  -3.314464 -0.744843 2.018433
H  -1.283607 0.718735 0.157214
H  -1.798895 -3.54794 -0.529847
H  0.707343 -3.809027 -0.671773
H  4.858212 1.343344 1.905868
H  2.284255 2.447819 -1.408943
H  5.428211 0.25134 -2.059392
H  4.340475 -2.382405 1.213623
H  -7.806305 -0.20372 1.314545
H  -4.616008 2.187987 -1.743251
H  -4.306576 -3.174986 2.210539
H  6.116953 3.491602 1.652983
H  3.560212 4.594913 -1.685241
H  7.846045 -0.284584 -1.696511
H  6.767946 -2.905744 1.599782
H  -8.592819 1.81164 0.013714
H  5.477348 5.12334 -0.149129
H  8.525903 -1.860128 0.140414
H  -7.938947 3.491876 -1.527958
