program: Gaussian 09
title: 000133259
version: EM64L-G09RevD.01
frameworkgroup: C1[X(C19H20N4O4)]
method: RPBEPBE
basis: SDD
operation: Freq
keyword: #p
keyword: freq=noraman
keyword: PBEPBE/SDD
title: #p freq=noraman PBEPBE/SDD
converged: YES YES NO NO
title: Mulliken charges:
elementType: O O O O N N N N C C C C C C C C C C C C C C C C C C C H H H H H H H H H H H H H H H H H H H H
charge: -0.243984 -0.200631 -0.389644 -0.264685 -0.465822 -0.273641 0.019440 -0.039226 -0.006186 -0.219823 -0.388869 -0.731416 -0.746910 0.194275 -0.713982 0.529102 0.259508 -0.617881 0.021984 0.123292 -0.334040 -0.333848 -0.243900 0.255930 0.049071 -0.371175 0.134626 0.191912 0.198210 0.248284 0.205635 0.214021 0.206693 0.229110 0.262126 0.220945 0.218392 0.213279 0.208738 0.222497 0.317286 0.281691 0.320992 0.268825 0.296040 0.290450 0.383309
chargesum: 0.00000
title: Mulliken charges with hydrogens summed into heavy atoms:
elementType: O O O O N N N N C C C C C C C C C C C C C C C C C C C
charge: -0.243984 -0.200631 -0.006335 -0.264685 -0.148536 -0.273641 0.019440 -0.039226 0.185726 -0.021613 0.065049 -0.081591 -0.045447 0.194275 -0.069468 0.529102 0.259508 -0.336190 0.021984 0.123292 -0.013048 -0.065023 0.052140 0.255930 0.049071 -0.080726 0.134626
polarizability: 4.73116863e+02 -3.02089925e+01 2.66823266e+02 1.87295064e+01 1.38090152e+01 1.40509462e+02
1716.lowfreq: -13.2959 -1.4759 -0.0004 0.0007 0.0008 4.9190 16.3781 20.0080 29.1351
frequency: 16.1015 17.8039 29.1219 41.3395 45.8152 49.1661 58.2692 75.1348 85.0205 118.3811 142.6111 149.7890 177.4169 194.0156 197.3314 198.5073 209.4058 225.7522 245.7721 258.1274 277.5822 283.7174 293.6553 309.6715 324.6366 342.4072 345.0502 378.3984 399.2203 408.7612 426.3727 472.1699 478.6545 503.9849 511.0284 548.6031 563.6590 580.8003 606.0519 606.2313 617.9252 648.2700 660.4295 671.1062 690.6629 699.1708 720.7795 731.6291 754.0804 765.5420 769.4586 783.2598 797.1317 800.2166 857.5680 872.0561 873.7270 888.3239 905.0613 918.5056 921.1870 955.7410 962.8869 979.5527 982.2529 999.7548 1012.3494 1026.1368 1029.6580 1047.2160 1056.7406 1083.9052 1104.8944 1118.8552 1132.4677 1155.7139 1167.0630 1176.8078 1179.7724 1197.2588 1237.9120 1246.1018 1261.1082 1273.8446 1279.9092 1297.5204 1325.7013 1334.1062 1336.0798 1345.1605 1356.1424 1360.5828 1361.8798 1379.2610 1390.3478 1393.6429 1397.0242 1425.8389 1463.9406 1466.0087 1469.4839 1474.7828 1478.6252 1480.2673 1482.9857 1487.0449 1488.9281 1504.4563 1527.7141 1555.0181 1569.9824 1609.7942 1617.7048 1630.7051 1669.8176 2939.8835 2955.0857 2974.5590 2978.0253 2983.8176 2998.2991 3036.8218 3067.0835 3070.9171 3075.2976 3082.0000 3087.0283 3109.3817 3142.2584 3156.2642 3170.7556 3193.1983 3195.1196 3501.8479 3520.9279
redmass: 3.9844 4.3501 8.1770 5.6654 4.3288 3.0125 3.9704 5.2865 5.6408 4.3761 4.7919 4.2131 4.2213 2.1057 1.6572 1.7838 1.3164 1.7196 5.8555 2.8656 3.4252 6.8545 4.8554 4.6822 4.2563 4.2755 4.2580 11.5891 7.1848 2.4424 3.6596 3.2756 6.1891 5.6766 5.5785 3.9028 6.9562 4.1437 2.5745 2.0919 2.9271 6.4603 1.5573 2.7505 4.4166 5.5601 6.0528 4.7097 3.1571 2.0682 6.0781 3.6679 2.2360 4.6658 5.6742 2.5037 1.5358 5.4635 3.5163 1.4091 1.5903 1.5568 2.3224 1.4523 1.8390 1.7306 1.3215 4.3352 1.4855 2.7416 3.1309 1.6327 3.2437 2.3749 2.3024 1.9893 2.2269 2.1620 2.1575 2.3974 1.6298 1.3617 3.9484 1.2081 1.8399 1.2960 2.1022 1.5414 1.9295 1.5768 1.6698 1.9641 3.5334 1.2257 1.2063 1.1950 4.4676 4.6518 3.4187 1.0560 1.0496 1.0565 3.5320 1.2166 1.0632 1.0609 1.0598 3.1867 4.3064 5.3255 7.4766 8.5041 5.4663 5.4923 12.2208 1.0821 1.0832 1.0362 1.0368 1.0610 1.0366 1.0997 1.0994 1.0992 1.0998 1.0986 1.0991 1.0996 1.0922 1.0927 1.0909 1.0941 1.0963 1.0638 1.0763
irintensity: 0.1147 0.0976 0.8212 2.9493 1.7157 0.7049 1.7312 0.7371 2.0338 2.6314 0.7927 2.2851 1.6085 2.2543 0.7190 0.7259 0.1103 0.4519 2.1847 1.5206 4.0078 1.7290 1.7661 3.9509 0.8156 3.0868 10.1647 3.6525 12.5797 3.6763 10.1692 0.2732 8.6692 10.9172 4.1571 2.5868 14.8446 1.2801 94.6956 107.7576 0.2537 34.8413 19.2102 15.6271 39.8140 22.4031 3.2073 1.3515 4.8072 5.8738 15.0194 1.4096 2.6039 16.5635 3.8797 7.2225 40.3441 6.9315 37.7184 12.2578 38.0094 4.4211 0.1844 7.2338 2.1398 22.1780 1.2672 334.9403 4.9514 4.6818 126.5933 17.1466 38.9107 162.0182 11.2766 56.0820 25.0217 45.2654 24.4739 0.7235 42.4929 7.0531 90.2777 14.0115 84.2298 13.4186 54.0816 110.5507 189.1505 0.8659 77.7026 187.5550 32.6614 13.3558 23.1346 21.8612 128.8888 27.1530 30.4760 2.0832 8.6490 27.0020 1005.0611 234.8489 11.3356 4.9366 8.3535 495.0512 42.4642 137.2836 51.3590 217.2647 136.5471 72.8863 416.5217 20.6251 48.1585 32.0401 36.1697 24.4733 32.1088 4.0323 16.1265 86.5252 43.5712 47.0016 33.7045 14.4332 11.2153 0.4389 5.9187 16.3113 15.3646 49.0395 11.8998
temp: 298.150 k
press: 1.00000 atm
elementType: 8 8 8 8 7 7 7 7 6 6 6 6 6 6 6 6 6 6 6 6 6 6 6 6 6 6 6 1 1 1 1 1 1 1 1 1 1 1 1 1 1 1 1 1 1 1 1
symmnumber: 1
zpe: 957782.0 jmol-1
zpe.correction: 0.364800 hartree
zpe.thermalcorrener: 0.390098 hartree
zpe.thermalcorrenthalpy: 0.391042 hartree
zpe.thermalcorrgfe: 0.306618 hartree
zpe.sumelectzpe: -1254.021553 hartree
zpe.sumelectthermal: -1253.996255 hartree
zpe.sumelectthermalent: -1253.995311 hartree
zpe.sumelectthermalfe: -1254.079735 hartree
dipole: -4.9616 -2.4411 -0.5082
dipole: 5.5529
quadrupole: -168.3146 -169.4632 -158.2002
quadrupole: 10.6983 -0.2544 0.6496
quadrupole: -2.9886 -4.1372 7.1258 10.6983 -0.2544 0.6496
hfenergy: -1254.386353 hartree
pointgroup: C01 [X(C19H20N4O4)]
dipole: -1.9531729 -0.9489816 -0.2395499 debye
polarizability: 473.8148458|-30.3955229|263.686028|10.3752668|24.0523373|142.948717 unknown
InChI: InChI=1S/C19H20N4O4/c1-4-10(2)11(3)17(24)22-12-5-6-15-13(7-12)16-20-8-14(19(26)27)18(25)23(16)9-21-15/h5-11,22,26H,4H2,1-3H3
charge 0 multiplicity 1
47 atoms
O  -4.434785 1.547909 -0.434468
O  5.616146 1.072979 0.421568
O  7.107784 -1.236893 0.003033
O  5.955386 -3.176583 -0.525126
N  -2.742746 -0.071256 -0.599837
N  3.277641 0.839084 0.163632
N  1.985829 2.851048 0.513784
N  2.243459 -1.266222 -0.410332
C  -5.588376 -1.425926 0.387295
C  -5.079608 -0.777904 -0.961341
C  -6.515537 -0.47542 1.193304
C  -6.258044 -2.793061 0.104553
C  -6.211989 -0.243548 -1.865941
C  -4.083223 0.351821 -0.652319
C  -6.760384 -0.941965 2.645636
C  -1.578208 0.681305 -0.310809
C  0.858351 0.717536 -0.077858
C  -0.336657 0.01186 -0.349804
C  0.817753 2.118526 0.240813
C  2.150543 0.050555 -0.116259
C  -1.624617 2.080899 0.008517
C  -0.440898 2.775887 0.277907
C  3.137882 2.214023 0.468422
C  4.678796 0.284443 0.157062
C  4.697395 -1.134728 -0.168581
C  3.493216 -1.817003 -0.428726
C  5.937577 -1.946768 -0.25018
H  -4.687781 -1.619391 1.012005
H  -4.540074 -1.581031 -1.50906
H  -6.073236 0.538686 1.207952
H  -7.486915 -0.384851 0.667924
H  -7.18794 -2.670731 -0.480767
H  -5.585125 -3.465364 -0.460787
H  -6.522977 -3.303414 1.046982
H  -6.671644 0.653733 -1.420932
H  -5.818934 0.04241 -2.858025
H  -6.992765 -1.008486 -2.017557
H  -7.286334 -1.913216 2.687746
H  -5.805664 -1.050115 3.195103
H  -7.37883 -0.20749 3.192969
H  -2.583704 -1.059057 -0.814633
H  -0.257666 -1.05437 -0.589975
H  -2.593799 2.581862 0.030591
H  -0.456301 3.841874 0.521857
H  4.080548 2.726989 0.6696
H  3.552275 -2.883699 -0.668471
H  7.875783 -1.86724 -0.076967
