program: Gaussian 09
title: 000133290
version: EM64L-G09RevD.01
frameworkgroup: C1[X(C21H30BrNO2)]
method: RPBEPBE
basis: SDD
operation: Freq
keyword: #p
keyword: freq=noraman
keyword: PBEPBE/SDD
title: #p freq=noraman PBEPBE/SDD
converged: NO YES NO NO
title: Mulliken charges:
elementType: Br O O N C C C C C C C C C C C C C C C C C C C C C H H H H H H H H H H H H H H H H H H H H H H H H H H H H H H
charge: -0.049403 -0.235427 -0.261806 -0.385645 -0.189106 0.432961 -0.121037 -0.104694 0.239228 -0.511943 -0.154904 -0.521656 -0.528935 -0.476089 -0.547231 0.538833 -0.817467 -0.635556 -0.494883 -0.815599 -0.559351 -0.584876 0.177105 0.284261 -0.760208 0.208420 0.222414 0.202647 0.212443 0.215274 0.278996 0.216326 0.221378 0.234108 0.222638 0.215455 0.232657 0.231015 0.243903 0.246469 0.223039 0.216398 0.221806 0.233753 0.216470 0.213560 0.220047 0.232651 0.235265 0.314540 0.245490 0.232605 0.255822 0.308489 0.309351
chargesum: 0.00000
title: Mulliken charges with hydrogens summed into heavy atoms:
elementType: Br O O N C C C C C C C C C C C C C C C C C C C C C
charge: -0.049403 -0.235427 -0.261806 -0.071105 0.019313 0.432961 0.101377 0.097952 0.239228 -0.084226 0.124092 -0.083952 -0.072190 -0.027976 -0.072312 0.538833 -0.131561 -0.179997 -0.064853 -0.127636 -0.081256 -0.329054 0.177105 0.284261 -0.142368
polarizability: 3.24581489e+02 -1.52552026e+00 2.36845623e+02 1.73480370e+01 -6.00035979e+00 1.83148594e+02
1716.lowfreq: -16.6152 -12.0583 -0.0620 -0.0466 -0.0004 5.1339 16.1613 17.5796 30.0122
frequency: 14.0365 16.8848 29.9931 44.3109 60.6534 78.7410 84.9052 99.9457 133.8315 150.9792 163.7209 174.0548 178.5025 193.6450 205.1356 227.0182 236.2254 242.9688 258.7803 274.3806 292.7418 308.4768 314.1782 331.8839 363.9962 371.5141 380.3100 405.2085 411.5360 429.0810 457.8959 470.4549 506.7649 516.7299 527.6523 544.3703 556.0008 571.4377 593.5876 617.4831 620.9710 642.6769 649.9380 668.7564 691.9131 732.9821 765.3331 776.4962 786.9018 812.2812 835.0800 852.1328 863.7817 870.4189 879.3049 885.3610 909.7577 917.4366 927.7244 934.7510 939.5524 954.9840 971.0601 985.2999 997.3524 1002.4147 1017.8580 1028.4509 1044.2902 1045.7793 1062.2795 1077.6055 1079.9172 1094.1329 1115.3977 1120.2676 1125.3790 1131.9688 1139.1819 1143.4186 1162.0554 1183.3923 1186.5312 1188.0757 1197.8591 1200.4274 1213.7823 1223.8965 1231.3748 1236.9286 1243.1347 1251.8717 1260.6711 1273.5509 1279.3376 1283.4520 1292.8058 1295.1716 1298.8693 1314.4264 1322.1639 1325.8648 1335.0076 1340.2635 1344.2963 1345.0235 1352.0400 1354.1487 1356.7388 1368.0494 1386.0185 1392.7387 1413.1689 1443.7696 1456.9889 1460.8648 1465.9210 1467.6922 1469.8153 1473.3854 1477.9701 1482.4955 1485.3289 1488.5021 1489.3299 1503.6949 1584.8562 1599.8615 1623.3532 2923.5926 2931.3284 2949.1881 2955.0235 2971.4113 2973.3275 2976.3812 2980.0140 2982.3012 2985.6433 2989.5353 3001.8185 3017.7929 3024.8915 3031.7757 3038.4960 3040.0915 3042.5800 3047.4329 3052.2946 3063.0024 3068.8970 3071.5361 3076.6959 3078.0129 3078.5328 3082.8621 3118.3920 3151.8827 3496.9001
redmass: 8.3113 6.2269 6.4081 4.6847 4.2934 3.7024 3.5276 4.1730 2.5167 3.4493 2.8647 3.1438 2.0771 1.3011 1.9868 1.6657 3.4754 3.2165 2.4219 2.2467 3.4887 3.7045 3.6912 2.6791 2.5569 3.4560 3.0021 2.9185 3.1566 3.5030 3.2682 2.7744 3.5082 2.5356 2.6847 3.1025 2.8079 3.1887 4.1419 3.2876 4.8472 3.0163 1.3672 3.2172 3.3521 2.9035 2.3649 2.1706 1.6253 2.0788 2.3135 2.2874 2.4557 1.7294 2.3456 1.4543 1.9645 1.8511 2.5218 2.0759 2.0242 1.8270 2.4162 2.1242 2.2605 1.9052 2.2822 1.8293 1.9885 2.2876 2.2453 2.0240 2.0473 2.4980 2.5001 1.4754 1.8016 2.0935 1.1592 2.4279 2.0422 1.9325 1.8695 1.9266 1.5447 1.3805 1.6681 1.3178 1.3894 1.5114 1.5378 1.7136 1.4644 1.5190 1.7083 1.4478 1.3262 1.3229 1.4643 1.4716 1.4907 1.5290 1.4215 1.4911 1.8443 1.5381 1.4694 1.4279 1.3579 1.4212 1.2059 1.2112 1.0992 1.0790 1.0872 1.0774 1.0878 1.0885 1.0787 1.0860 1.0619 1.0590 1.0614 1.0990 1.0840 1.8022 10.0351 9.1020 7.6994 1.0807 1.0821 1.0836 1.0655 1.0593 1.0599 1.0635 1.0389 1.0612 1.0437 1.0530 1.0602 1.0644 1.0989 1.0989 1.0880 1.0997 1.0979 1.0998 1.1008 1.0959 1.0565 1.0983 1.0996 1.1029 1.0990 1.0990 1.0912 1.1090 1.0773
irintensity: 0.6070 0.5158 3.1510 0.4872 5.0912 6.4386 7.4735 1.5522 1.5475 0.1038 1.0817 1.9529 1.8874 0.3521 0.6259 0.5126 6.9597 2.4095 0.2401 0.2773 0.3466 1.4702 6.4457 0.5206 1.3883 2.3140 4.0110 1.0005 3.8459 6.3866 3.7931 2.4505 4.6088 3.5695 0.3241 0.2755 2.2420 3.9176 2.6957 14.3041 89.6893 3.9819 73.2564 1.4800 10.5745 4.0020 7.2906 3.1443 5.9636 1.9719 1.7760 2.7109 9.5823 13.8431 6.4554 17.6736 3.2525 6.9676 5.5278 5.0907 13.4194 7.2586 1.3687 4.8619 0.9760 3.7240 3.4316 6.2009 2.7457 5.2131 3.8193 9.5576 3.1433 4.2163 4.0660 5.1486 3.3771 14.7291 0.1953 0.5729 3.3705 0.5150 3.2470 20.0072 8.5916 7.9885 6.7664 26.0301 25.4121 15.0582 1.2525 28.1712 3.1177 0.9458 33.9124 12.6860 3.5958 0.5650 2.4805 4.1568 7.5168 0.6319 3.4364 0.7568 7.1646 0.7534 0.7016 2.6659 14.2311 3.0831 18.9773 18.6905 38.2182 18.7722 21.3889 0.8577 17.7414 7.6965 3.9328 10.1621 5.1886 12.1506 2.7170 37.9028 31.1612 285.7250 169.0674 241.9522 193.8270 21.0829 15.9170 33.8218 17.7070 35.9924 43.9984 21.6359 18.7434 24.2100 5.1409 37.1314 30.8964 23.9345 31.6622 35.9594 6.8012 34.2242 63.6330 35.5047 4.7185 22.8546 2.5341 34.5714 33.0329 50.6415 29.9941 25.5120 10.5848 0.0467 39.4518
temp: 298.150 k
press: 1.00000 atm
elementType: 35 8 8 7 6 6 6 6 6 6 6 6 6 6 6 6 6 6 6 6 6 6 6 6 6 1 1 1 1 1 1 1 1 1 1 1 1 1 1 1 1 1 1 1 1 1 1 1 1 1 1 1 1 1 1
symmnumber: 1
zpe: 1235558.2 jmol-1
zpe.correction: 0.470599 hartree
zpe.thermalcorrener: 0.495063 hartree
zpe.thermalcorrenthalpy: 0.496007 hartree
zpe.thermalcorrgfe: 0.414660 hartree
zpe.sumelectzpe: -1034.997455 hartree
zpe.sumelectthermal: -1034.972991 hartree
zpe.sumelectthermalent: -1034.972047 hartree
zpe.sumelectthermalfe: -1035.053394 hartree
dipole: -2.7524 -0.3615 -1.0367
dipole: 2.9633
quadrupole: -222.7809 -166.3377 -158.0160
quadrupole: 16.3956 -13.2697 1.8556
quadrupole: -40.4027 16.0405 24.3622 16.3956 -13.2697 1.8556
hfenergy: -1035.4680539 hartree
pointgroup: C01 [X(C21H30Br1N1O2)]
dipole: -1.0325903 0.1631135 0.5160614 debye
polarizability: 320.96743|-2.8687653|237.0465543|-27.9683147|6.0672276|186.5617212 unknown
InChI: InChI=1S/C21H30BrNO2/c1-20-9-7-14(24)11-13(20)3-4-15-16-5-6-18(23-19(25)12-22)21(16,2)10-8-17(15)20/h11,15-18,23H,3-10,12H2,1-2H3
charge 0 multiplicity 1
55 atoms
Br -6.182041 2.144466 1.254341
O  6.712212 0.529645 -1.068027
O  -5.338324 -1.881655 0.265165
N  -4.130302 0.093857 -0.071557
C  -1.024222 0.649308 0.095078
C  -1.731367 -0.744267 0.152648
C  0.441506 0.642518 0.617528
C  1.309057 -0.460668 -0.055008
C  2.814259 -0.481888 0.447488
C  -0.818269 -1.818266 -0.514745
C  -2.987195 -0.532513 -0.769816
C  0.612822 -1.840984 0.069799
C  -1.215119 1.133566 -1.378278
C  1.09211 2.034395 0.456507
C  -2.482779 0.394124 -1.918307
C  3.387106 0.946809 0.407373
C  -2.116217 -1.179214 1.583372
C  2.535825 2.047227 1.012884
C  3.634011 -1.408974 -0.504999
C  2.926484 -1.000913 1.918076
C  5.162272 -1.241617 -0.3822
C  4.627147 1.233795 -0.106278
C  5.584118 0.213315 -0.578646
C  -5.205041 -0.619799 0.37649
C  -6.363106 0.117027 1.054606
H  -1.592706 1.340871 0.756967
H  0.39273 0.418237 1.706078
H  1.36536 -0.215172 -1.13995
H  -0.750399 -1.631105 -1.605367
H  -1.288983 -2.814094 -0.39439
H  -3.358653 -1.505886 -1.137726
H  0.569756 -2.144958 1.133089
H  1.198597 -2.617175 -0.456976
H  -0.333524 0.884013 -1.995957
H  -1.331231 2.230426 -1.426801
H  0.484016 2.800075 0.977983
H  1.116707 2.31422 -0.61499
H  -3.278553 1.094096 -2.229956
H  -2.236856 -0.2112 -2.807585
H  -2.749907 -2.084326 1.559244
H  -1.224355 -1.405936 2.193687
H  -2.681027 -0.38567 2.105577
H  2.486751 1.899219 2.11303
H  3.013194 3.030195 0.847097
H  3.339464 -1.184688 -1.550492
H  3.366919 -2.46508 -0.315837
H  2.273446 -0.4379 2.6079
H  2.647427 -2.067415 1.98214
H  3.962048 -0.902413 2.289325
H  -4.129433 1.107811 0.075082
H  5.699472 -1.869038 -1.1152
H  5.510124 -1.560435 0.621831
H  4.987059 2.270684 -0.139642
H  -6.494193 -0.26146 2.079175
H  -7.286205 -0.03469 0.475669
