program: Gaussian 09
title: 000133152
version: EM64L-G09RevD.01
frameworkgroup: C1[X(C13H14N2O4)]
method: RPBEPBE
basis: SDD
operation: Freq
keyword: #p
keyword: freq=noraman
keyword: PBEPBE/SDD
title: #p freq=noraman PBEPBE/SDD
converged: YES YES NO NO
title: Mulliken charges:
elementType: O O O O N N C C C C C C C C C C C C C H H H H H H H H H H H H H H
charge: -0.228715 -0.213898 -0.233866 -0.427938 -0.182929 -0.367494 -0.000522 -0.383240 0.413552 0.180386 0.086549 -0.719777 -0.349297 -0.359732 0.184467 -0.596599 -0.403688 -0.368645 0.289610 0.237457 0.235662 0.233919 0.232444 0.224435 0.365126 0.256189 0.281738 0.255206 0.254224 0.268481 0.224172 0.255596 0.357123
chargesum: 0.00000
title: Mulliken charges with hydrogens summed into heavy atoms:
elementType: O O O O N N C C C C C C C C C C C C C
charge: -0.228715 -0.213898 -0.233866 -0.070815 -0.182929 -0.002368 -0.000522 0.089879 0.413552 0.180386 0.086549 -0.028978 -0.093107 -0.077994 0.184467 0.181312 -0.179516 -0.113048 0.289610
polarizability: 1.92468747e+02 1.21142644e+00 1.40754422e+02 -1.04694776e+00 3.09324320e+00 1.59896351e+02
1716.lowfreq: -15.8288 -7.6940 -0.0010 -0.0007 -0.0006 3.4942 21.7499 32.8959 71.9331
frequency: 21.1788 32.8519 71.8448 80.4196 105.7492 114.1862 139.1699 157.0993 162.3207 182.4559 198.9126 250.3884 265.1097 278.6351 302.3840 332.5241 359.8374 371.3087 372.7177 380.2851 403.8206 410.1857 440.6410 464.5918 500.2725 534.0976 575.5237 632.4442 650.7857 666.9642 676.8147 697.1565 710.4759 724.5300 761.2444 774.1160 804.1487 807.8326 841.5727 847.7574 914.2924 938.6467 952.7473 965.4663 980.2540 1004.2472 1047.6216 1080.4689 1112.7771 1127.8073 1130.7194 1143.8234 1152.8759 1156.6750 1178.8504 1197.3656 1238.9599 1259.5003 1293.4171 1311.7271 1326.0772 1337.3086 1359.0602 1379.0109 1382.5263 1389.7812 1425.3575 1433.0472 1448.1676 1472.5118 1481.8986 1482.7918 1484.5959 1501.6655 1583.9741 1592.2194 1623.0234 1640.1840 1657.1830 2986.4252 3018.6460 3024.2027 3072.7435 3082.3561 3097.9656 3111.9064 3119.8335 3143.5966 3149.2306 3159.5630 3172.6703 3517.8929 3581.0810
redmass: 3.8876 8.0782 4.5702 3.8964 2.4610 1.0585 6.2979 5.2877 9.7250 6.6127 1.3377 3.7385 4.4453 3.7885 2.3263 3.7755 4.9940 3.7420 1.3413 8.9342 3.9877 3.1102 7.1514 5.5375 5.6515 2.8636 7.7452 6.4437 3.1322 4.2262 5.7893 4.5971 7.1614 4.1325 1.4735 1.7493 4.1467 1.5631 1.6794 2.6451 4.7945 1.4353 2.2142 1.8796 1.3674 3.0916 2.6193 2.6010 1.6038 2.7916 1.4426 1.5552 2.8310 2.4022 3.6490 1.1552 3.1815 2.5477 1.3020 2.5696 1.3561 1.6315 4.7342 1.9014 4.6225 1.2186 3.0588 1.2958 1.0902 1.0580 1.0552 1.0788 1.0431 2.4070 10.3738 6.3831 6.1466 6.4082 7.8070 1.0357 1.0333 1.0603 1.1009 1.0981 1.1034 1.1022 1.0896 1.0894 1.1025 1.0940 1.0958 1.0768 1.0661
irintensity: 1.1129 0.6618 0.0800 2.3943 0.3720 0.0803 0.2506 0.7015 13.8773 0.4283 0.6537 0.2715 3.9919 2.6734 2.7850 2.3950 5.7435 27.6245 124.0606 31.4559 13.3670 2.8375 9.2089 6.6138 8.6724 51.9260 0.9419 2.8657 17.5270 5.0800 2.6771 13.2514 1.3312 0.8255 2.9140 100.7117 29.7190 26.6187 45.1012 1.6945 12.8630 3.1891 0.9598 14.5571 0.9630 11.5101 38.9448 4.6158 58.6991 41.4170 3.8146 158.6635 15.7339 36.9628 36.5846 24.5396 12.2564 23.5837 19.5975 205.7560 29.4497 68.6107 178.4904 8.9495 27.5529 21.0902 16.5657 100.5254 36.5758 16.4796 7.1168 16.0777 19.7585 115.7127 263.0144 47.2808 44.8821 332.2202 255.0387 28.7230 19.5885 12.8634 3.7318 33.7172 19.7765 13.5367 16.4689 0.1529 0.4397 3.8077 4.9617 65.4646 48.9268
temp: 298.150 k
press: 1.00000 atm
elementType: 8 8 8 8 7 7 6 6 6 6 6 6 6 6 6 6 6 6 6 1 1 1 1 1 1 1 1 1 1 1 1 1 1
symmnumber: 1
zpe: 667104.1 jmol-1
zpe.correction: 0.254087 hartree
zpe.thermalcorrener: 0.271986 hartree
zpe.thermalcorrenthalpy: 0.272930 hartree
zpe.thermalcorrgfe: 0.207709 hartree
zpe.sumelectzpe: -912.838132 hartree
zpe.sumelectthermal: -912.820233 hartree
zpe.sumelectthermalent: -912.819289 hartree
zpe.sumelectthermalfe: -912.884510 hartree
dipole: -1.2730 -0.3745 0.8495
dipole: 1.5756
quadrupole: -104.7112 -118.0460 -111.5218
quadrupole: 2.3699 -12.2914 0.4775
quadrupole: 6.7151 -6.6196 -0.0955 2.3699 -12.2914 0.4775
hfenergy: -913.0922187 hartree
pointgroup: C01 [X(C13H14N2O4)]
dipole: 0.5177426 -0.1035781 -0.3247377 debye
polarizability: 192.4699098|-1.4450679|142.1118951|0.5410019|-5.8183645|158.5377148 unknown
InChI: InChI=1S/C13H14N2O4/c1-3-13(8-4-6-9(16)7-5-8)10(17)14-12(19)15(2)11(13)18/h4-7,14,16H,3H2,1-2H3
charge 0 multiplicity 1
33 atoms
O  -1.386317 -0.402134 2.20684
O  -0.824318 2.270275 -1.727449
O  -2.750198 -1.92839 -1.980726
O  4.991478 -0.936873 0.111588
N  -1.974549 -1.230509 0.129664
N  -1.725619 0.148751 -1.795376
C  -0.530318 0.856303 0.274812
C  -0.561644 2.146674 1.155585
C  0.944748 0.341238 0.166158
C  -1.343946 -0.269774 0.954683
C  -1.040639 1.180423 -1.13675
C  -1.967043 2.747923 1.361009
C  1.723129 0.530028 -1.002003
C  1.556584 -0.266206 1.296849
C  -2.174708 -1.074322 -1.259697
C  -2.545869 -2.431174 0.787293
C  3.07094 0.113098 -1.049757
C  2.899023 -0.682912 1.259886
C  3.659308 -0.496188 0.082511
H  0.098739 2.884319 0.666407
H  -0.116895 1.887895 2.131979
H  -2.422582 3.054325 0.402285
H  -2.641457 2.036006 1.869735
H  -1.899151 3.649379 1.995797
H  -1.972549 0.306304 -2.778079
H  1.299309 1.023823 -1.881569
H  0.978675 -0.414944 2.215077
H  -3.373286 -2.140866 1.455251
H  -1.766542 -2.923176 1.3900
H  -2.911557 -3.105225 0.000209
H  3.65633 0.271058 -1.964769
H  3.371912 -1.150488 2.12828
H  5.443015 -0.763439 -0.751523
