program: Gaussian 09
title: 000133233
version: EM64L-G09RevD.01
frameworkgroup: C1[X(C18H25NO13)]
method: RPBEPBE
basis: SDD
operation: Freq
keyword: #p
keyword: freq=noraman
keyword: PBEPBE/SDD
title: #p freq=noraman PBEPBE/SDD
converged: NO YES NO NO
title: Mulliken charges:
elementType: O O O O O O O O O O O O O N C C C C C C C C C C C C C C C C C C H H H H H H H H H H H H H H H H H H H H H H H H H
charge: -0.281306 -0.289288 -0.224250 -0.495047 -0.284556 -0.459164 -0.499139 -0.432178 -0.416673 -0.437290 -0.436541 -0.212948 -0.215501 0.022512 -0.060830 -0.112857 -0.095586 -0.196682 -0.155739 -0.072418 -0.185173 0.031975 -0.133006 -0.105852 -0.377164 -0.358195 0.383393 -0.263606 -0.365531 -0.360418 -0.333074 0.378576 0.254567 0.278989 0.252040 0.264653 0.228407 0.210980 0.285941 0.267416 0.253440 0.256098 0.171846 0.221749 0.215349 0.219512 0.385979 0.356799 0.383262 0.360482 0.333862 0.355338 0.348014 0.301229 0.261536 0.286531 0.289536
chargesum: 0.00000
title: Mulliken charges with hydrogens summed into heavy atoms:
elementType: O O O O O O O O O O O O O N C C C C C C C C C C C C C C C C C C
charge: -0.281306 -0.289288 -0.224250 -0.109068 -0.284556 -0.102365 -0.115877 -0.071696 -0.082811 -0.081952 -0.088527 -0.212948 -0.215501 0.022512 0.193738 0.166132 0.156454 0.067972 0.072668 0.138562 0.100768 0.299391 0.120434 0.150246 0.016430 0.076666 0.383393 0.037622 -0.103995 -0.073887 -0.043537 0.378576
polarizability: 3.36620484e+02 -3.08852883e+01 2.16597639e+02 -8.02866949e-01 -1.25892985e+01 2.20162915e+02
1716.lowfreq: -8.3380 -4.3716 -0.0007 0.0007 0.0008 4.1164 8.1716 17.6712 24.2213
frequency: 6.0653 17.4470 23.9965 27.2226 33.7577 50.4691 58.8452 66.8696 72.5859 79.9031 88.4340 90.6438 105.8236 128.7861 137.5386 146.1717 163.5973 172.3911 185.2782 197.8664 209.1960 224.4369 232.6655 241.5610 257.9273 274.0718 280.9524 293.4806 295.9020 300.2622 317.2355 326.5601 342.2828 346.2094 360.0908 365.7163 392.8379 397.6694 404.4164 415.4453 425.9372 449.4737 450.7294 456.7524 469.7201 495.0217 500.8459 511.1161 511.8946 551.4933 597.0067 606.5256 611.6579 621.5924 642.9786 655.3503 664.0863 673.3249 691.2018 727.3907 731.9754 755.6279 765.0047 779.3452 794.2780 818.4900 831.6609 834.3481 859.4965 875.9917 886.7006 895.8018 930.1030 952.7045 960.4590 973.9446 979.4393 983.3702 986.9249 989.3133 998.4285 1001.1593 1010.8587 1016.4179 1025.8181 1033.5945 1047.1003 1052.2270 1055.6733 1073.5762 1083.5608 1095.0392 1098.0809 1107.2518 1111.3353 1116.5639 1121.0041 1171.0440 1188.6206 1197.0242 1200.4401 1202.8530 1211.5863 1214.2872 1225.0371 1229.3809 1233.5439 1238.8187 1247.7138 1261.5232 1276.8305 1280.4728 1294.4172 1295.9622 1300.5496 1306.1389 1311.2937 1314.3128 1320.1179 1328.5417 1343.2751 1346.2106 1354.2348 1358.4475 1358.6439 1368.1602 1370.4871 1384.6348 1386.9031 1392.0679 1400.9133 1404.8037 1425.7482 1430.8201 1455.2644 1457.0050 1463.2154 1476.2222 1593.1680 1608.9147 2930.6622 2944.0258 2968.4664 2995.4090 3001.4847 3006.1732 3016.7775 3025.9108 3027.9012 3031.0682 3038.8627 3059.8775 3060.4765 3087.9596 3167.0774 3175.8598 3188.6086 3192.8778 3207.5068 3527.0153 3534.6977 3544.3081 3548.5820 3581.6556 3595.1638
redmass: 7.6954 7.7004 6.1906 6.1258 6.6063 6.4825 6.9942 5.8779 6.5098 5.9181 5.2557 5.5708 3.6701 8.3231 7.0831 6.4117 5.8552 4.7830 1.7517 3.4369 4.2235 3.1058 3.8795 3.9892 2.9991 4.1025 5.0155 6.0746 5.4253 1.2680 5.2893 5.3615 4.2352 4.3315 3.0261 1.9603 5.5979 5.2518 6.2334 3.0055 1.4199 1.5908 3.5319 2.0207 4.3651 3.3106 4.6150 5.7266 1.4216 3.2167 5.0939 5.0993 4.3764 2.8469 5.5364 3.5375 4.6216 2.4710 2.9974 5.0856 4.9287 3.2629 5.6732 4.7128 3.6800 5.3782 1.3668 3.5970 1.6908 4.0261 3.5361 5.7320 2.5617 4.5613 3.9465 4.6939 1.3614 2.8448 1.3658 3.5512 2.9982 5.0449 5.6147 4.2119 2.1922 4.0838 2.4419 3.3578 3.4889 3.3156 2.8401 3.0061 2.2539 2.2286 1.2553 2.2352 2.1160 1.4702 1.3793 1.2867 1.2295 1.4299 2.3584 1.4123 4.9702 1.1766 1.5014 1.2516 1.2657 1.2596 1.2384 1.5299 1.3090 1.2042 1.2561 1.3611 1.1994 1.3167 1.2513 1.3162 1.2082 1.3004 1.3520 1.5662 3.1133 1.2157 1.3381 1.4532 1.3643 1.4899 1.4764 9.3500 1.5466 4.0518 1.2863 1.0878 1.0869 2.4157 7.7949 6.6761 1.0610 1.0816 1.0843 1.0653 1.0956 1.0850 1.0853 1.0863 1.0833 1.0869 1.0876 1.0882 1.0869 1.0997 1.0894 1.0891 1.0965 1.0973 1.0704 1.0652 1.0652 1.0648 1.0653 1.0668 1.0668
irintensity: 0.9048 1.1448 0.7074 0.1931 1.2196 1.7795 0.8087 6.7712 0.2850 1.9846 2.6569 9.4001 5.9555 1.3803 2.4932 5.1833 5.3864 16.5025 38.2897 43.8238 47.4998 44.0677 19.7596 41.8142 5.4414 11.8521 14.9471 2.8639 18.6453 84.0607 8.1759 30.5573 4.8826 10.6574 101.9477 27.2836 3.1808 0.7307 2.1092 0.4469 128.5019 163.6457 55.1469 36.2848 7.5061 12.5580 4.6840 0.6092 113.6951 34.9378 23.9031 0.9917 4.8860 2.2178 80.0121 144.7582 19.9922 52.8636 66.7554 1.7810 8.5917 10.8614 21.2177 3.8718 9.9862 19.7896 2.7823 6.0852 61.7295 150.0138 77.0675 462.2415 108.9539 71.7140 280.8069 13.3204 1.2576 103.5346 1.7515 88.5426 7.3828 8.2428 36.2295 103.5241 1.2282 125.9576 10.4203 135.8290 59.2028 100.2882 157.6532 19.8486 35.0069 78.6930 25.5137 9.9332 56.6733 213.5756 1.7653 22.1843 25.8587 62.4681 236.8067 30.7270 242.4645 72.2847 47.3121 16.9265 17.2000 6.2684 4.9954 12.5885 2.1292 5.0932 5.5845 24.0227 1.6952 24.7199 24.3224 19.4663 11.3114 20.6246 6.3599 45.2327 65.6936 29.6013 4.1612 19.0037 26.2350 14.4767 7.1631 26.5879 1.6894 20.2207 36.7432 11.2524 6.1547 89.6223 48.2135 188.9006 85.8423 20.5929 84.9144 35.3205 18.8708 2.8355 4.5785 13.6412 20.1330 53.0002 26.7834 13.2650 13.9397 25.0825 1.4926 0.3246 1.5914 3.0974 692.9361 17.0888 4.6656 44.2548 5.8192 8.6874 17.0752
temp: 298.150 k
press: 1.00000 atm
elementType: 8 8 8 8 8 8 8 8 8 8 8 8 8 7 6 6 6 6 6 6 6 6 6 6 6 6 6 6 6 6 6 6 1 1 1 1 1 1 1 1 1 1 1 1 1 1 1 1 1 1 1 1 1 1 1 1 1
symmnumber: 1
zpe: 1147024.0 jmol-1
zpe.correction: 0.436878 hartree
zpe.thermalcorrener: 0.468908 hartree
zpe.thermalcorrenthalpy: 0.469852 hartree
zpe.thermalcorrgfe: 0.370239 hartree
zpe.sumelectzpe: -1730.932855 hartree
zpe.sumelectthermal: -1730.900826 hartree
zpe.sumelectthermalent: -1730.899881 hartree
zpe.sumelectthermalfe: -1730.999495 hartree
dipole: -2.4785 7.3252 -1.1192
dipole: 7.8137
quadrupole: -287.6639 -184.3822 -167.8648
quadrupole: 5.0313 2.9437 13.5485
quadrupole: -74.3603 28.9215 45.4389 5.0313 2.9437 13.5485
hfenergy: -1731.3697335 hartree
pointgroup: C01 [X(C18H25N1O13)]
dipole: 1.4948219 2.6314051 0.540017 debye
polarizability: 343.760084|6.9928382|208.4516069|0.9504051|11.9815446|221.1693466 unknown
InChI: InChI=1S/C18H25NO13/c20-5-9-11(22)13(24)15(26)17(30-9)32-16-14(25)12(23)10(6-21)31-18(16)29-8-3-1-7(2-4-8)19(27)28/h1-4,9-18,20-26H,5-6H2
charge 0 multiplicity 1
57 atoms
O  1.899352 -0.189516 0.294414
O  2.69419 -2.415033 0.737101
O  -0.385665 1.185966 -0.936352
O  2.387317 1.905755 2.19026
O  -1.545164 0.706291 1.148865
O  1.486137 4.067357 0.669545
O  4.496731 0.899086 0.736526
O  5.940487 -0.542978 -1.22783
O  5.296431 -3.29397 -0.337706
O  -1.420729 3.557173 -2.401036
O  1.101369 -4.411282 -0.446695
O  -7.35363 -0.340185 -1.333949
O  -7.865647 0.053997 0.855174
N  -7.019418 -0.062006 -0.11619
C  0.815443 0.388959 1.090315
C  1.126734 1.854402 1.427648
C  2.881431 -0.999931 1.025206
C  1.240702 2.707159 0.155681
C  4.298332 -0.540012 0.607971
C  4.584357 -0.919908 -0.858514
C  -0.457065 0.331161 0.218737
C  -0.081998 2.61778 -0.646208
C  4.372705 -2.435744 -1.08655
C  2.904329 -2.751802 -0.721545
C  -0.033334 3.309207 -2.003373
C  2.501382 -4.222474 -0.8394
C  -2.879747 0.50736 0.751023
C  -3.276992 0.22213 -0.580682
C  -3.835871 0.621387 1.791629
C  -4.642084 0.028045 -0.859437
C  -5.198015 0.437101 1.510779
C  -5.587075 0.135256 0.184364
H  0.648342 -0.192556 2.016721
H  0.305512 2.259442 2.051745
H  2.722039 -0.900936 2.114451
H  2.0919 2.346082 -0.456896
H  5.025635 -1.061872 1.265946
H  3.846927 -0.376405 -1.491533
H  -0.621509 -0.683539 -0.184121
H  -0.903882 3.057675 -0.047469
H  4.574518 -2.677736 -2.144579
H  2.208814 -2.124521 -1.31071
H  0.521545 4.269935 -1.91185
H  0.497147 2.652051 -2.722972
H  3.184613 -4.853464 -0.237362
H  2.562266 -4.542248 -1.892869
H  2.551946 2.861725 2.401946
H  1.869835 4.642009 -0.037492
H  3.767413 1.299735 1.307318
H  6.080877 0.379308 -0.88537
H  5.056393 -3.242129 0.624189
H  -1.460856 3.803777 -3.358355
H  1.01004 -4.048546 0.472273
H  -2.542953 0.19801 -1.388942
H  -3.491437 0.846276 2.804919
H  -4.988011 -0.190935 -1.872858
H  -5.960311 0.515031 2.289898
