program: Gaussian 09
title: 000133234
version: EM64L-G09RevD.01
frameworkgroup: C1[X(C18H25NO13)]
method: RPBEPBE
basis: SDD
operation: Freq
keyword: #p
keyword: freq=noraman
keyword: PBEPBE/SDD
title: #p freq=noraman PBEPBE/SDD
converged: YES YES NO NO
title: Mulliken charges:
elementType: O O O O O O O O O O O O O N C C C C C C C C C C C C C C C C C C H H H H H H H H H H H H H H H H H H H H H H H H H
charge: -0.307744 -0.285495 -0.208228 -0.455611 -0.291301 -0.455830 -0.451152 -0.461345 -0.459101 -0.417345 -0.445539 -0.211961 -0.220013 0.022138 -0.013834 -0.232521 -0.068836 -0.102048 -0.211417 -0.146843 -0.169147 -0.014955 -0.114741 -0.010665 -0.396183 -0.386597 0.397629 -0.282925 -0.374582 -0.373758 -0.338052 0.373188 0.222263 0.264828 0.241097 0.238451 0.270184 0.240552 0.288974 0.237192 0.221715 0.280751 0.232515 0.232069 0.200105 0.263970 0.356833 0.364126 0.370869 0.367826 0.369427 0.335991 0.352732 0.322312 0.258203 0.293456 0.288374
chargesum: 0.00000
title: Mulliken charges with hydrogens summed into heavy atoms:
elementType: O O O O O O O O O O O O O N C C C C C C C C C C C C C C C C C C
charge: -0.307744 -0.285495 -0.208228 -0.098778 -0.291301 -0.091704 -0.080283 -0.093519 -0.089674 -0.081354 -0.092807 -0.211961 -0.220013 0.022138 0.208429 0.032308 0.172261 0.136403 0.058767 0.093709 0.119827 0.222237 0.106974 0.270085 0.068402 0.077478 0.397629 0.039387 -0.116379 -0.080302 -0.049678 0.373188
polarizability: 3.37856605e+02 -2.26393601e+01 2.33682438e+02 4.50211118e-01 -3.07295318e+01 1.98364557e+02
1716.lowfreq: -3.9527 0.0004 0.0006 0.0007 4.4025 6.3486 15.3175 23.3458 27.3969
frequency: 15.2692 23.0853 27.2896 34.0858 37.1235 51.4619 67.9540 72.2312 76.1089 79.9468 87.1257 94.5677 99.2157 118.1421 134.4682 144.0144 156.3264 180.4908 192.9194 202.8869 213.8270 218.9552 231.5777 240.6005 259.4836 264.0818 282.8339 292.1843 295.0465 302.2342 314.2364 331.4125 355.4619 366.6412 377.7434 394.3931 403.2717 410.4898 414.4625 419.9340 426.6680 429.9217 437.0308 444.3526 462.3110 486.1809 496.7027 508.5063 514.0178 524.8225 551.7787 558.5650 567.5967 603.3843 611.7338 636.2436 641.7795 645.7545 664.1239 723.7546 730.8797 758.2729 775.9945 789.4561 798.6410 821.4098 831.8843 857.9894 864.8569 896.7896 901.8612 932.5853 947.4103 955.3469 961.3391 967.6550 980.1702 987.0008 992.9023 996.8074 997.8833 1004.4554 1007.4372 1024.5756 1030.5115 1040.8072 1046.8036 1050.7353 1058.8866 1068.4041 1087.7861 1091.5761 1095.4587 1096.8024 1110.3945 1114.9964 1125.5008 1169.4113 1178.7912 1180.5866 1199.6026 1207.7685 1211.0617 1223.9694 1225.3942 1227.2632 1231.4010 1249.0675 1261.4398 1277.7038 1291.5003 1296.2919 1299.8990 1300.9050 1305.8854 1307.0045 1315.2742 1321.9804 1324.0654 1333.4787 1343.3671 1346.8878 1352.2496 1357.1527 1359.2986 1365.8219 1375.9444 1380.7957 1381.6506 1387.4758 1395.8331 1397.4317 1403.6340 1403.9173 1432.2369 1453.8530 1460.0908 1479.5422 1593.1891 1607.7562 2957.3902 2980.9485 2983.2389 2984.8589 2986.9654 2996.5471 2999.5304 3012.4277 3023.2639 3023.8142 3064.5453 3068.9635 3090.2432 3120.8445 3163.7196 3171.6873 3187.3253 3189.9750 3470.3072 3544.0133 3550.2851 3554.0325 3555.7769 3563.2881 3580.4866
redmass: 8.3075 6.2600 6.8587 6.4623 7.2784 6.2416 6.6147 5.7412 6.2355 6.1882 4.3737 5.6222 6.4116 4.5662 6.8262 6.9936 7.6788 3.9892 5.4812 3.6160 5.2957 5.1957 3.5223 4.1482 3.7652 1.9869 1.3644 3.4798 4.3550 4.7395 3.8706 4.3459 5.3990 4.0517 4.8200 2.8187 3.8963 4.4003 3.0484 2.7827 1.2016 1.2418 1.6107 1.7125 3.2035 4.8044 3.1956 6.8588 5.8450 4.1090 3.6253 1.1769 3.4662 6.0939 5.6582 6.3725 5.5529 4.9946 4.6100 5.9700 5.0476 6.5553 5.0621 3.0685 3.1226 6.6141 1.2813 1.7325 3.7054 4.6727 5.2468 5.0541 3.4613 4.6546 4.7704 3.3702 1.3342 1.4180 2.8228 2.8076 3.6350 2.8058 4.5765 3.3495 4.0811 3.6411 2.7788 2.8519 3.3788 3.0440 3.3772 2.3138 2.5989 2.4844 2.0667 1.2670 2.6869 1.3010 1.6001 1.3419 1.3281 1.3646 3.2308 1.2905 1.2280 4.6760 1.2394 1.4204 1.4654 1.2670 1.2187 1.2895 1.2493 1.3263 1.1900 1.2234 1.2363 1.2289 1.2321 1.2940 1.1856 1.2663 1.3099 7.2687 1.3344 1.3334 1.2926 1.2352 1.2794 1.4488 1.4057 1.6972 2.1440 4.7398 3.9076 1.0851 1.0805 2.3105 7.4877 6.5925 1.0821 1.0845 1.0696 1.0827 1.0835 1.0695 1.0786 1.0859 1.0848 1.0869 1.0889 1.0865 1.1004 1.0960 1.0895 1.0902 1.0959 1.0971 1.0653 1.0654 1.0657 1.0656 1.0656 1.0665 1.0667
irintensity: 0.3856 0.0625 0.0802 0.4241 0.3616 1.7523 5.5085 1.9973 0.1201 2.3595 1.1679 6.8189 0.2386 2.3962 0.5050 8.1517 1.8607 1.4855 18.2756 19.6335 0.3600 5.3117 3.1832 22.4189 52.6991 63.0618 131.0300 8.7752 11.1636 6.7691 49.4196 28.1634 11.3231 4.5382 8.5316 1.2519 28.5217 1.5253 11.4080 62.7493 79.7206 254.7021 66.5209 118.7816 31.7039 3.4435 7.0225 10.6139 6.9573 6.4911 19.6474 150.3126 43.7685 8.1562 8.5555 50.3198 14.6911 15.4930 19.6262 21.4402 6.4066 19.4453 13.4120 15.8015 47.8256 14.0705 4.2054 55.8582 91.9736 315.5444 190.2156 49.7577 96.9692 177.3303 239.8758 19.9038 3.0410 1.7152 42.1864 6.7666 73.3219 31.2494 12.3234 47.9416 84.9414 73.4750 178.1162 47.2450 100.4983 12.0898 59.5506 30.9342 49.7024 14.0595 33.6076 25.6846 37.5769 20.5705 320.1732 19.0741 13.5514 47.4105 252.0726 10.5090 40.2097 265.3412 64.4173 1.9663 3.8478 10.2304 29.1854 45.8491 9.2117 0.7693 14.9690 10.7428 5.6967 14.1036 2.0094 4.3910 7.0868 18.4753 7.4708 95.0248 5.6857 0.5329 28.8080 6.7166 26.2935 7.8816 0.7910 7.5400 14.3487 23.3479 21.5422 8.6458 6.2517 74.0882 40.7886 187.0432 15.0990 48.1815 49.1554 16.3209 11.7734 22.1195 16.8863 67.9972 15.8474 35.6576 3.9970 22.5265 15.0065 5.6377 2.4019 2.6114 1.5616 5.6290 53.5829 20.3946 22.1271 25.6376 6.2487 7.1154 16.1532
temp: 298.150 k
press: 1.00000 atm
elementType: 8 8 8 8 8 8 8 8 8 8 8 8 8 7 6 6 6 6 6 6 6 6 6 6 6 6 6 6 6 6 6 6 1 1 1 1 1 1 1 1 1 1 1 1 1 1 1 1 1 1 1 1 1 1 1 1 1
symmnumber: 1
zpe: 1148794.4 jmol-1
zpe.correction: 0.437553 hartree
zpe.thermalcorrener: 0.469571 hartree
zpe.thermalcorrenthalpy: 0.470515 hartree
zpe.thermalcorrgfe: 0.372678 hartree
zpe.sumelectzpe: -1730.940648 hartree
zpe.sumelectthermal: -1730.908629 hartree
zpe.sumelectthermalent: -1730.907685 hartree
zpe.sumelectthermalfe: -1731.005522 hartree
dipole: -7.1383 4.8013 -5.5617
dipole: 10.2440
quadrupole: -243.5028 -180.2555 -186.7860
quadrupole: 16.9517 -4.5467 -1.3443
quadrupole: -39.9881 23.2593 16.7288 16.9517 -4.5467 -1.3443
hfenergy: -1731.3782006 hartree
pointgroup: C01 [X(C18H25N1O13)]
dipole: 2.9400891 1.2783988 2.4423277 debye
polarizability: 340.3630642|15.4497162|219.1087907|4.3002351|34.3917951|210.4317451 unknown
InChI: InChI=1S/C18H25NO13/c20-5-9-11(22)13(24)15(26)17(30-9)32-16-14(25)12(23)10(6-21)31-18(16)29-8-3-1-7(2-4-8)19(27)28/h1-4,9-18,20-26H,5-6H2
charge 0 multiplicity 1
57 atoms
O  2.382021 0.262932 0.848804
O  1.895673 -2.112449 0.705619
O  0.072148 0.987497 -0.85262
O  2.567283 2.8212 2.04211
O  -1.231615 0.97506 1.193543
O  1.534982 4.344313 -0.118178
O  5.007332 -0.124173 1.455365
O  5.747316 -1.726227 -0.945182
O  3.545036 -2.518153 -2.620341
O  -0.845449 2.732242 -3.160653
O  -0.335452 -2.945154 -0.72119
O  -6.65929 -1.604517 -1.026682
O  -7.44789 -0.244243 0.627764
N  -6.484342 -0.745492 -0.07645
C  1.153024 0.854478 1.382846
C  1.339574 2.383485 1.355453
C  2.721974 -1.083413 1.309394
C  1.480826 2.882318 -0.091935
C  4.211067 -1.240459 0.935442
C  4.371667 -1.361356 -0.593836
C  -0.043125 0.45836 0.478033
C  0.250066 2.464972 -0.926302
C  3.470391 -2.469423 -1.16092
C  2.008044 -2.17393 -0.790417
C  0.408553 2.819459 -2.409337
C  1.013919 -3.252755 -1.223043
C  -2.500554 0.509292 0.80027
C  -2.718389 -0.419876 -0.250075
C  -3.583254 1.031472 1.552692
C  -4.033903 -0.832593 -0.530972
C  -4.894569 0.623297 1.266957
C  -5.106667 -0.310804 0.225536
H  0.965509 0.486939 2.413353
H  0.445018 2.853725 1.811905
H  2.546368 -1.179677 2.397485
H  2.402447 2.441365 -0.525677
H  4.616792 -2.145419 1.418793
H  4.096439 -0.394214 -1.066726
H  -0.111135 -0.634352 0.348972
H  -0.648837 2.95777 -0.502199
H  3.788942 -3.439708 -0.719135
H  1.704895 -1.194093 -1.207426
H  0.859707 3.82913 -2.478797
H  1.076283 2.08507 -2.889543
H  1.34747 -4.250253 -0.870597
H  0.94042 -3.263228 -2.320075
H  2.431328 2.814198 3.022371
H  2.244484 4.61864 0.519444
H  4.468959 0.705025 1.322758
H  6.357289 -1.079313 -0.50556
H  4.506388 -2.530465 -2.866286
H  -1.445289 3.469427 -2.881474
H  -0.311781 -3.046699 0.264862
H  -1.896235 -0.813462 -0.852979
H  -3.375142 1.747263 2.353085
H  -4.238697 -1.547937 -1.331477
H  -5.750522 1.005909 1.828324
