program: Gaussian 09
title: 000133223
version: EM64L-G09RevD.01
frameworkgroup: C1[X(C16H10N4O8S2)]
method: RPBEPBE
basis: SDD
operation: Freq
keyword: #p
keyword: freq=noraman
keyword: PBEPBE/SDD
title: #p freq=noraman PBEPBE/SDD
converged: YES YES NO NO
title: Mulliken charges:
elementType: S S O O O O O O O O N N N N C C C C C C C C C C C C C C C C H H H H H H H H H H
charge: 1.050346 0.991576 -0.194683 -0.207061 -0.683230 -0.527841 -0.467319 -0.472606 -0.464416 -0.539880 -0.058217 -0.087258 -0.011935 0.017736 0.072865 0.001596 0.287366 0.279845 -0.013858 -0.330693 0.030547 -0.324261 -0.202465 -0.203806 -0.082143 0.052365 -0.282735 -0.180871 -0.358783 -0.157698 0.290140 0.305014 0.301396 0.294755 0.267015 0.247366 0.439487 0.429627 0.253015 0.239702
chargesum: 0.00000
title: Mulliken charges with hydrogens summed into heavy atoms:
elementType: S S O O O O O O O O N N N N C C C C C C C C C C C C C C C C
charge: 1.050346 0.991576 -0.194683 -0.207061 -0.243743 -0.098214 -0.467319 -0.472606 -0.464416 -0.539880 -0.058217 -0.087258 -0.011935 0.017736 0.072865 0.001596 0.287366 0.279845 -0.013858 -0.040553 0.030547 -0.019247 0.098931 0.090949 -0.082143 0.052365 -0.015720 0.066495 -0.105767 0.082004
polarizability: 5.26211677e+02 -1.05592158e+01 3.34505368e+02 1.13224909e+01 -2.92051736e+01 1.65111390e+02
1716.lowfreq: -4.9889 -3.0715 0.0002 0.0009 0.0015 2.2339 16.7611 30.7646 35.4206
frequency: 16.7045 30.7540 35.4106 41.8100 47.2225 63.5021 77.8780 84.2748 91.3951 108.8437 119.8428 127.5758 133.7674 157.8475 174.9658 178.4738 187.9880 193.4508 219.1347 244.3486 262.1158 272.8427 280.5222 290.4911 315.6129 325.0346 339.1575 356.5102 360.6083 375.3114 383.5205 401.0505 407.3536 437.0533 452.6139 477.0104 482.8821 510.5541 536.5927 567.4072 581.9907 586.1532 598.3608 608.6183 614.6565 620.1582 636.7706 658.7382 689.3312 701.9598 720.1270 745.2608 774.8855 781.7956 795.4874 815.8771 827.1925 829.3027 833.6862 886.5375 887.8740 891.1051 902.5404 906.0082 910.0409 910.4530 949.9905 957.9493 969.0535 971.2321 974.6373 1003.8824 1007.0582 1009.4340 1016.1024 1038.2603 1050.0430 1085.2466 1097.1887 1099.7816 1122.6899 1138.8861 1155.6929 1164.7446 1185.5699 1194.1538 1265.6756 1285.2889 1290.4806 1320.6757 1323.0257 1333.4992 1360.8710 1375.3083 1388.0814 1414.2418 1442.9640 1458.4506 1479.8434 1483.1450 1558.7717 1561.9362 1572.4309 1575.0538 2790.0782 2988.4154 3137.2798 3149.6261 3168.8852 3180.8880 3242.1273 3243.2181 3257.3736 3258.5464
redmass: 7.8395 5.6111 5.8616 5.9734 7.5018 12.0392 9.1616 7.7792 8.4338 9.4047 11.9360 7.8423 11.3343 11.0905 9.0653 10.8437 8.7803 11.1892 10.5848 8.2630 8.7444 8.8857 8.7808 7.9248 8.7287 7.3470 9.2877 7.1998 8.8648 10.0081 7.5875 3.7682 6.8264 12.7185 12.2369 8.9389 4.8501 9.5181 14.7796 8.0199 6.1017 3.4261 8.8663 7.0787 6.1662 1.2900 10.4474 5.3724 6.7350 6.4651 1.1539 1.8174 4.6174 6.8815 4.6366 3.6586 1.3307 1.2894 14.7378 8.1436 8.1461 7.1652 7.2701 1.4378 1.3301 1.3847 11.4405 6.2906 1.6237 4.7399 7.9716 1.7875 1.4434 1.3589 3.2306 2.7110 4.4195 1.7468 5.0282 4.4890 5.5484 1.1973 5.0605 1.0786 1.7276 1.7710 4.0672 6.7601 2.0733 4.6675 7.2915 3.8096 1.1057 4.6924 5.7229 1.9580 5.2094 4.4230 7.0941 7.5444 5.9499 6.9089 7.1271 6.9343 1.0720 1.0691 1.0884 1.0904 1.0954 1.1002 1.0950 1.0948 1.1046 1.1047
irintensity: 0.4009 2.5844 4.6091 1.1315 2.2432 5.4731 2.9742 1.0216 0.5278 3.5057 2.4935 2.0142 0.0206 4.9676 13.7741 11.5444 10.6091 0.3792 2.4671 5.4483 14.0698 5.1900 8.9986 13.0353 5.7987 4.3409 8.8199 4.4854 33.1272 18.5438 14.8438 3.1750 5.6062 93.4731 33.9786 14.3883 41.6936 48.5263 122.3178 10.5474 37.1067 39.0184 107.0880 12.0975 17.3394 41.7899 7.6683 12.6438 13.4215 1.4917 391.5039 34.9916 17.8332 47.7808 16.4794 6.7471 87.4805 32.1885 155.8604 4.3703 20.6254 30.5702 8.2353 2.0560 1.1298 0.9266 154.4152 4.7345 5.2786 10.6480 57.8389 25.7675 13.8430 2.6605 31.8565 8.0354 85.8577 7.9840 50.1290 83.4622 19.5307 216.3495 22.8698 1.1665 27.7936 6.6119 6.1762 17.6147 41.5243 4.2864 2.7395 28.9657 38.6397 31.8560 51.4625 14.9273 120.8887 3.1927 17.7101 3.7750 15.1950 9.9712 38.8110 23.6793 558.0119 841.0761 15.0778 9.4282 25.4983 17.0056 1.5171 1.4862 11.5061 7.7305
temp: 298.150 k
press: 1.00000 atm
elementType: 16 16 8 8 8 8 8 8 8 8 7 7 7 7 6 6 6 6 6 6 6 6 6 6 6 6 6 6 6 6 1 1 1 1 1 1 1 1 1 1
symmnumber: 1
zpe: 645876.5 jmol-1
zpe.correction: 0.246001 hartree
zpe.thermalcorrener: 0.272915 hartree
zpe.thermalcorrenthalpy: 0.273859 hartree
zpe.thermalcorrgfe: 0.186957 hartree
zpe.sumelectzpe: -2230.012539 hartree
zpe.sumelectthermal: -2229.985625 hartree
zpe.sumelectthermalent: -2229.984681 hartree
zpe.sumelectthermalfe: -2230.071583 hartree
dipole: -9.6739 1.8604 -1.9246
dipole: 10.0374
quadrupole: -189.7145 -183.7217 -199.9535
quadrupole: -22.6147 14.1339 -11.9761
quadrupole: 1.4154 7.4082 -8.8236 -22.6147 14.1339 -11.9761
hfenergy: -2230.2585401 hartree
pointgroup: C01 [X(C16H10N4O8S2)]
dipole: -3.8418815 0.5067065 -0.7601389 debye
polarizability: 527.0095474|-2.2839263|327.1345149|8.2484874|-43.9404812|171.6843729 unknown
InChI: InChI=1S/C16H10N4O8S2/c21-29(22,23)12-6-4-10(27-12)14-15(11-5-7-13(28-11)30(24,25)26)19-20-16(18-14)9-3-1-2-8-17-9/h1-8,21,24H
charge 0 multiplicity 1
40 atoms
S  3.677858 2.919235 0.129126
S  4.557844 -1.747163 -0.641272
O  1.366851 1.381253 0.269352
O  1.893429 -1.244346 -0.088843
O  4.464373 1.43013 -0.636282
O  4.121327 -0.728398 -2.067853
O  3.948199 2.836152 1.716757
O  4.050786 4.213761 -0.751682
O  5.292774 -3.095972 -1.104501
O  5.290994 -0.77664 0.467944
N  -2.144349 0.471723 -0.138492
N  -1.476767 -1.796693 1.282015
N  -2.772722 -1.435913 1.212388
N  -5.333519 -1.264012 0.089379
C  -0.817868 0.204338 0.074801
C  -0.478748 -1.080905 0.624618
C  0.072647 1.297896 -0.290637
C  0.781508 -1.801291 0.584382
C  1.933878 2.51974 -0.292843
C  -0.130985 2.377119 -1.15629
C  2.89217 -2.209566 -0.011188
C  1.115889 -3.07615 1.054647
C  1.074211 3.160446 -1.167808
C  2.476519 -3.339459 0.672203
C  -3.079289 -0.390419 0.32968
C  -4.501363 -0.181368 -0.032879
C  -4.945159 1.089532 -0.484433
C  -6.307557 1.251475 -0.812267
C  -6.643546 -1.087541 -0.232447
C  -7.178129 0.145114 -0.68159
H  -1.038852 2.558207 -1.725728
H  0.443976 -3.730777 1.604001
H  1.292413 4.058686 -1.740007
H  3.068403 -4.229533 0.870805
H  -4.230979 1.913525 -0.56027
H  -6.683512 2.21998 -1.157113
H  4.952161 0.856918 0.064557
H  4.191056 0.254372 -1.734678
H  -7.281793 -1.972056 -0.128864
H  -8.24223 0.227303 -0.92349
