program: Gaussian 09
title: 000133125
version: EM64L-G09RevD.01
frameworkgroup: C1[X(C6H8N4O5S2)]
method: RPBEPBE
basis: SDD
operation: Freq
keyword: #p
keyword: freq=noraman
keyword: PBEPBE/SDD
title: #p freq=noraman PBEPBE/SDD
converged: YES YES NO NO
title: Mulliken charges:
elementType: S S O O O O O N N N N C C C C C C H H H H H H H H
charge: 0.997203 0.356548 -0.169238 -0.529852 -0.485882 -0.407262 -0.240886 -0.388206 0.062562 -0.003584 -0.714699 -0.564322 -0.469038 0.245071 -0.316222 -0.087404 0.193121 0.244157 0.288546 0.268216 0.295696 0.341821 0.344771 0.356102 0.382780
chargesum: 0.00000
title: Mulliken charges with hydrogens summed into heavy atoms:
elementType: S S O O O O O N N N N C C C C C C
charge: 0.997203 0.356548 -0.169238 -0.529852 -0.485882 -0.024482 -0.240886 -0.046385 0.062562 -0.003584 -0.013826 -0.031618 0.094875 0.245071 -0.316222 -0.087404 0.193121
polarizability: 2.49579081e+02 -1.37016642e+00 1.42088275e+02 -3.98196562e+00 1.74337514e+00 9.52702779e+01
1716.lowfreq: -13.3052 -3.1144 -0.7241 -0.0029 -0.0020 -0.0015 4.2022 18.5246 26.8855
frequency: -7.9593 18.5067 26.8262 33.8523 47.6975 57.1759 74.2662 93.9180 110.1728 126.6982 134.7308 188.8943 211.2372 235.2691 247.3916 285.8931 295.1684 305.2514 338.9825 379.6147 416.0575 433.1079 461.1177 506.8360 523.4178 541.6677 561.2103 565.6581 582.6442 595.6100 608.0965 646.7491 687.3928 758.9614 774.4638 808.2338 814.5102 865.2279 908.7817 917.1111 929.8036 992.3274 1016.5493 1045.9043 1072.2317 1085.7172 1119.0390 1136.7849 1161.0985 1240.9637 1262.8217 1326.5436 1370.7977 1380.9629 1439.9354 1447.1707 1456.2132 1479.6335 1528.3584 1660.2019 1673.4477 2983.0588 3006.7962 3038.4478 3078.0437 3388.0922 3516.2104 3534.6608 3561.3699
redmass: 6.0151 8.3816 9.6458 9.8036 7.3856 5.2098 3.2306 3.1963 4.8890 2.8041 8.5469 3.7171 6.0375 9.6583 3.1655 6.9735 7.9049 5.8186 9.5423 6.2004 10.4883 3.2517 3.7687 2.3054 3.2467 10.4317 3.6768 4.1432 3.8996 2.8447 3.3778 1.4262 7.4317 1.9259 3.6531 2.2886 9.4340 5.7261 9.9831 4.6833 4.0929 8.9837 2.1920 3.8063 1.5751 2.8254 2.7593 3.2739 1.2305 1.3234 1.3330 1.6591 11.2190 2.0083 1.1745 1.1918 1.4722 4.8417 1.0867 8.3533 7.0415 1.0608 1.0644 1.0982 1.0965 1.0410 1.0640 1.0772 1.1022
irintensity: 1.8713 0.8451 1.0093 11.8456 0.0409 2.8058 6.1051 12.2899 2.2957 11.4143 1.3512 14.8607 2.0191 1.1615 8.0767 5.1562 4.0616 5.8631 5.3167 11.3111 115.4487 149.8965 91.7518 76.4529 14.4636 7.5952 30.9417 20.3175 23.7555 19.9064 48.6882 124.1922 2.2227 202.9161 9.2865 13.0962 61.4178 6.0291 30.3451 3.2830 61.2712 39.3158 52.1879 111.7184 35.0819 239.3292 50.8674 161.2132 6.4620 64.1308 41.7309 120.7508 24.0041 46.2861 130.1104 149.7896 545.9429 239.8244 29.1208 251.5172 71.2329 21.1884 25.3150 8.4964 5.0390 51.0652 32.6315 41.7478 37.8731
temp: 298.150 k
press: 1.00000 atm
elementType: 16 16 8 8 8 8 8 7 7 7 7 6 6 6 6 6 6 1 1 1 1 1 1 1 1
symmnumber: 1
zpe: 413438.9 jmol-1
zpe.correction: 0.157471 hartree
zpe.thermalcorrener: 0.175723 hartree
zpe.thermalcorrenthalpy: 0.176667 hartree
zpe.thermalcorrgfe: 0.107426 hartree
zpe.sumelectzpe: -1623.173894 hartree
zpe.sumelectthermal: -1623.155642 hartree
zpe.sumelectthermalent: -1623.154698 hartree
zpe.sumelectthermalfe: -1623.223938 hartree
dipole: 3.8183 2.4440 1.1053
dipole: 4.6663
quadrupole: -103.1626 -126.8821 -111.2768
quadrupole: 5.3302 -23.9634 -5.8585
quadrupole: 10.6112 -13.1082 2.4970 5.3302 -23.9634 -5.8585
hfenergy: -1623.3313645 hartree
pointgroup: C01 [X(C6H8N4O5S2)]
dipole: -1.5326321 -0.9592703 0.318101 debye
dipolederiv: 2.4271409 0.0367049 0.2351329 -0.0957791 1.1710467 0.0455907 0.2931489 0.027859 1.6701253 -0.4559078 -0.0194073 -0.0304341 0.2678772 -0.3860033 -0.0115899 -0.051887 -0.0168189 0.1876602 -0.7248906 -0.0221708 -0.036486 0.5048032 -0.615853 -0.2617599 0.3564936 -0.2578885 -0.4628846 -0.7416483 0.0363695 -0.0445656 0.1671445 -0.5798613 -0.0759572 -0.0604842 0.0538629 -0.4927672 -0.8060516 -0.0381787 0.0191898 -0.1523902 -0.492761 0.1443825 0.0474618 0.0124202 -0.5903346 -1.1597609 0.5312216 -0.0666784 0.4986134 -0.5779824 0.0018695 -0.0518205 -0.0044668 -0.4176487 -0.7932529 -0.1239036 0.0448326 0.1054476 -0.9416105 0.1010819 0.017949 0.1088137 -0.3321373 -2.6127287 0.2652568 0.1489047 0.3421414 -0.3793718 -0.0166002 0.2985751 -0.0291278 -0.3836644 -0.1515509 -0.0753438 -0.0017361 0.027943 -0.3957509 0.0015906 -0.0464443 -0.0088326 -0.0700108 -0.6433221 0.1345103 -0.0473771 -0.5300411 -0.3300123 -0.0280297 -0.1412719 0.0114271 -0.1160531 -0.7522292 -0.0570276 -0.0545392 -0.0453505 -0.3823294 -0.0966043 -0.2113237 -0.0539337 -0.8854965 -0.3858268 -0.0608356 -0.0378216 -0.2851863 -0.0895996 -0.0541192 -0.0240533 -0.0358829 0.1128062 -0.2831187 -0.1108628 0.0257391 -0.3867652 -0.1183464 -0.0026981 -0.0775458 -0.0351313 0.0969916 2.2336843 -0.1678135 -0.1385192 -1.0522587 0.8256944 0.4589946 -0.7212221 0.4372132 0.5375785 -0.0612647 0.135895 0.0556518 0.2333128 0.4384042 0.0616651 0.0954759 0.036706 -0.188086 1.9133205 -0.2234897 0.0431268 0.4152517 0.5712072 -0.0622162 0.3482339 -0.068255 0.0420017 1.7217326 -0.1948116 -0.030042 -0.2517955 1.3214088 -0.168685 -0.0242468 -0.1595517 0.232366 0.0103143 0.0169476 0.0369607 0.0634354 0.0724582 -0.0633139 0.0411649 -0.078585 -0.0789042 0.1386283 0.0009227 -0.0163282 0.1048669 0.0221144 0.0581897 -0.0436673 0.0626856 0.0565677 0.0530662 0.0192203 -0.0122919 0.0679581 0.0457809 0.0733849 0.0126021 0.0922716 0.0240928 0.2038826 -0.0234197 -0.0034058 0.0700367 0.1022838 -0.0462333 0.0501144 -0.0398524 0.0255434 0.1825023 0.0231424 0.0117521 0.0923191 0.1908624 -0.0612628 -0.0533766 -0.0575903 0.2921537 0.2515711 -0.050246 -0.0696419 -0.0010465 0.1578218 0.0831299 -0.0499603 0.0210808 0.1371141 0.1794176 0.0661223 -0.0620294 -0.0098384 0.1749203 -0.1264218 -0.0380783 -0.0615142 0.2177398 0.2562924 -0.0988028 0.030606 -0.1506996 0.1954788 0.0456122 0.0341625 0.0430908 0.3852463 unknown
polarizability: 249.3468686|-5.0322155|142.0850878|4.4278524|3.4308347|95.5056772 unknown
InChI: InChI=1S/C6H8N4O5S2/c7-17(14,15)6-10-9-5(16-6)8-3(11)1-2-4(12)13/h8,12H,1-2,7H2
charge 0 multiplicity 1
25 atoms
S  4.8979 -0.377723 0.094809
S  1.906892 -1.535934 -0.162709
O  -1.708006 1.200162 0.832312
O  5.127982 -1.978943 -0.047424
O  5.643447 0.70479 -0.84863
O  -6.75066 0.624324 0.09935
O  -5.799623 -1.471299 0.407021
N  -0.728863 -0.539234 -0.419511
N  2.482104 1.082014 -0.046938
N  1.085115 1.052069 -0.204618
N  5.128661 0.006973 1.857491
C  -3.181123 -0.464777 -0.235137
C  -4.353208 0.498138 0.0147
C  -1.839497 0.182033 0.120392
C  3.021282 -0.115962 -0.030833
C  0.610525 -0.197101 -0.280171
C  -5.661081 -0.246329 0.188684
H  -3.176667 -0.812553 -1.285651
H  -3.322271 -1.368883 0.391538
H  -4.460844 1.242319 -0.792791
H  -4.158327 1.084205 0.934356
H  -0.943537 -1.408765 -0.913639
H  5.372844 1.000889 1.985434
H  5.796268 -0.663463 2.269363
H  -7.594513 0.11885 0.254903
