program: Gaussian 09
title: 000133126
version: EM64L-G09RevD.01
frameworkgroup: C1[X(C17H20O3S)]
method: RPBEPBE
basis: SDD
operation: Freq
keyword: #p
keyword: freq=noraman
keyword: PBEPBE/SDD
title: #p freq=noraman PBEPBE/SDD
converged: YES YES NO NO
title: Mulliken charges:
elementType: S O O O C C C C C C C C C C C C C C C C C H H H H H H H H H H H H H H H H H H H H
charge: -0.035695 -0.215388 -0.450243 -0.254197 0.253090 -0.460002 0.274725 -0.188464 -0.675901 0.064659 0.215534 -0.769849 -0.560605 -0.375392 0.138031 -0.511176 -0.345697 0.123588 -0.489802 0.307758 -0.796843 0.262178 0.215380 0.228372 0.302825 0.209363 0.234152 0.253680 0.213255 0.231284 0.225931 0.211970 0.233011 0.230904 0.243935 0.346923 0.105762 0.286302 0.238811 0.238533 0.239298
chargesum: 0.00000
title: Mulliken charges with hydrogens summed into heavy atoms:
elementType: S O O O C C C C C C C C C C C C C C C C C
charge: 0.070066 -0.215388 -0.103320 -0.254197 0.253090 0.017556 0.274725 0.039908 -0.373076 0.064659 0.215534 -0.072654 -0.116066 0.062509 0.138031 -0.047261 -0.101762 0.123588 -0.203500 0.307758 -0.080200
polarizability: 3.12423264e+02 2.75970827e+01 2.09253849e+02 8.61117247e+00 3.71391088e+00 1.40519198e+02
1716.lowfreq: -8.1099 -2.5708 -0.0014 -0.0013 0.0005 10.3966 34.6593 53.1199 77.4060
frequency: 34.6129 53.0612 77.3789 106.3374 115.5149 123.2202 134.6355 165.7102 173.9218 186.3556 204.5384 218.6451 223.2679 234.3789 253.2963 259.6669 266.7784 282.2903 290.6734 320.5107 323.7091 349.8173 383.9316 395.6091 441.9472 466.1163 475.2776 496.5983 511.7047 527.0227 569.0134 591.4897 604.6164 630.0511 651.7029 676.1148 706.3768 710.1114 743.8586 761.0106 816.5920 832.0764 837.7393 850.9651 870.7325 895.0408 904.1962 928.3474 947.6726 956.6567 977.0704 996.7995 1001.9435 1013.0387 1022.3273 1040.5666 1047.4560 1062.3808 1092.2087 1112.2684 1116.5451 1149.9377 1157.4785 1168.7986 1176.9555 1185.3145 1199.1885 1207.2983 1212.2769 1223.8615 1238.5525 1254.8339 1271.8021 1301.8271 1311.2211 1312.0445 1328.0885 1335.6143 1346.0422 1354.4309 1376.6519 1384.0347 1395.4846 1402.8711 1418.5534 1452.2821 1455.1913 1456.2812 1462.1638 1466.0344 1473.1996 1477.1464 1490.3139 1554.2894 1576.2706 1598.1556 1613.6181 2437.8145 2945.7771 2952.3764 2961.1261 2977.9624 2986.7017 2994.8250 3002.3516 3008.1190 3042.2687 3052.3072 3062.0013 3068.4089 3082.5140 3086.5769 3099.4751 3101.7059 3185.3969 3240.2845 3570.0862
redmass: 5.1897 4.9461 4.3161 2.6443 2.0233 1.6299 3.5682 3.6389 3.2660 2.5804 2.2876 1.2352 1.4305 3.0028 4.5357 1.3243 2.5766 4.7374 2.8506 2.9645 2.9706 3.4360 4.9651 3.7688 4.3750 4.9302 3.7129 4.9011 4.0835 3.9845 3.1781 4.4009 4.4186 3.5975 4.2460 4.6973 3.5865 3.8245 3.2141 3.3131 2.1929 1.4537 1.6048 1.3462 2.5249 4.7343 3.8078 2.1767 2.6932 2.2888 2.1676 1.8436 3.1577 1.6076 2.1462 2.4960 1.4489 3.2631 2.9667 2.5773 4.0114 1.4827 1.5732 2.1779 1.5073 2.4516 1.6503 1.4415 1.4604 2.0162 1.7612 1.7406 1.7214 1.4201 1.3813 1.4089 1.8268 1.5331 2.0598 1.3201 1.3700 1.9456 1.3834 1.2727 4.7987 1.0953 1.0853 1.0439 1.1157 1.0796 1.1080 1.0676 1.0629 7.8074 7.7739 6.8325 7.4982 1.0382 1.0695 1.0837 1.0660 1.0377 1.0655 1.0363 1.0812 1.0602 1.0917 1.0983 1.0927 1.0994 1.1025 1.1011 1.0972 1.1005 1.0922 1.0980 1.0665
irintensity: 0.7647 0.1567 0.1030 0.1094 0.8450 0.3638 1.3454 3.4967 3.0670 0.4839 8.5621 11.0046 7.5223 3.0367 4.6364 86.1136 17.8285 0.5726 11.7220 4.3235 2.9491 4.8396 3.5050 6.5592 7.6251 4.9010 6.4348 4.1358 6.7780 3.3932 9.0499 2.6725 0.3268 13.0767 29.3115 6.6661 2.5783 10.9557 10.3429 9.1515 4.2020 10.5096 21.0536 18.4259 36.4582 2.2065 36.1840 4.8600 2.7280 18.7326 2.5172 5.9707 88.9915 19.7717 2.4884 5.7605 5.3259 12.5860 87.4043 63.0985 167.7620 7.6868 3.5907 29.5236 19.3626 14.8562 8.2346 6.6519 2.0620 24.9698 22.0079 6.2200 13.6129 50.7550 2.5607 0.6026 2.7714 1.7364 20.7863 3.9261 6.6832 5.6581 14.5063 6.9756 1.6791 4.8060 6.9424 14.1909 3.9451 1.8179 14.8014 15.5187 9.5419 7.2043 15.7592 136.5923 20.9704 16.5974 36.4592 27.6360 31.2140 54.2599 17.7329 10.4876 12.9148 79.4165 24.6822 18.5008 27.4772 14.8849 46.2909 13.0488 12.5258 16.6969 11.3499 5.2820 7.6709
temp: 298.150 k
press: 1.00000 atm
elementType: 16 8 8 8 6 6 6 6 6 6 6 6 6 6 6 6 6 6 6 6 6 1 1 1 1 1 1 1 1 1 1 1 1 1 1 1 1 1 1 1 1
symmnumber: 1
zpe: 865556.1 jmol-1
zpe.correction: 0.329673 hartree
zpe.thermalcorrener: 0.349785 hartree
zpe.thermalcorrenthalpy: 0.350729 hartree
zpe.thermalcorrgfe: 0.282377 hartree
zpe.sumelectzpe: -1281.933122 hartree
zpe.sumelectthermal: -1281.913010 hartree
zpe.sumelectthermalent: -1281.912066 hartree
zpe.sumelectthermalfe: -1281.980418 hartree
dipole: -1.9084 -0.5188 -0.3458
dipole: 2.0076
quadrupole: -115.4494 -136.0158 -131.4134
quadrupole: -4.3166 2.6614 -0.3735
quadrupole: 12.1769 -8.3896 -3.7872 -4.3166 2.6614 -0.3735
hfenergy: -1282.2627945 hartree
pointgroup: C01 [X(C17H20O3S1)]
dipole: 0.7473219 -0.2360228 0.0983954 debye
polarizability: 311.1151909|-30.8032577|210.7247766|2.2667196|4.1682622|140.3563427 unknown
InChI: InChI=1S/C17H20O3S/c1-9-5-11-13(20-9)4-3-10-12-7-19-8-15(18)17(12,2)6-14(21)16(10)11/h5,7,14-15,18,21H,3-4,6,8H2,1-2H3
charge 0 multiplicity 1
41 atoms
S  -0.793354 2.963707 1.389411
O  3.806901 -1.885827 0.418761
O  4.362335 1.677043 -0.698099
O  -4.031671 -1.00967 -0.331123
C  2.220929 0.532357 -0.361346
C  1.504847 1.709022 0.356022
C  1.607509 -0.770742 0.184333
C  3.722806 0.565857 0.023313
C  -0.018666 1.705877 0.131752
C  0.143024 -0.8209 0.302612
C  -0.643704 0.327115 0.209863
C  2.03683 0.636511 -1.902188
C  -0.544181 -2.179853 0.530253
C  4.417486 -0.762409 -0.32771
C  -2.102303 0.165474 0.087573
C  -1.881388 -2.367031 -0.24121
C  2.410349 -1.828037 0.539911
C  -2.650022 -1.095185 -0.116211
C  -3.215297 1.104494 0.009104
C  -4.364583 0.376601 -0.24349
C  -5.808365 0.7203 -0.409453
H  1.928754 2.671924 0.021214
H  1.702979 1.621166 1.442603
H  3.798521 0.717721 1.122946
H  -0.283552 2.19416 -0.826062
H  2.553445 -0.186071 -2.42741
H  0.968062 0.573533 -2.169541
H  2.446185 1.59214 -2.270539
H  0.13117 -3.006976 0.253461
H  -0.754976 -2.281121 1.6160
H  4.341903 -0.965362 -1.412475
H  5.479166 -0.769071 -0.028173
H  -2.434831 -3.229324 0.173323
H  -1.685878 -2.592988 -1.311614
H  2.050419 -2.753924 0.992927
H  5.238825 1.877498 -0.283685
H  -0.584595 2.171936 2.50727
H  -3.164669 2.180502 0.151273
H  -5.942295 1.811083 -0.321425
H  -6.192376 0.404212 -1.397508
H  -6.435142 0.233656 0.361236
