program: Gaussian 09
title: 000133099
version: EM64L-G09RevD.01
frameworkgroup: C1[X(C9H10INO4)]
method: RPBEPBE
basis: SDD
operation: Freq
keyword: #p
keyword: freq=noraman
keyword: PBEPBE/SDD
title: #p freq=noraman PBEPBE/SDD
converged: YES YES NO NO
title: Mulliken charges:
elementType: I O O O O N C C C C C C C C C H H H H H H H H H H
charge: 0.075234 -0.404786 -0.410152 -0.398255 -0.259981 -0.552223 -0.630647 -0.181825 0.686671 -0.549508 -0.596224 0.174844 0.188467 -0.262404 0.162793 0.230942 0.272270 0.280216 0.265177 0.243181 0.280535 0.292159 0.360287 0.374911 0.358320
chargesum: 0.00000
title: Mulliken charges with hydrogens summed into heavy atoms:
elementType: I O O O O N C C C C C C C C C
charge: 0.075234 -0.044498 -0.035241 -0.039935 -0.259981 0.020470 -0.127435 0.098390 0.686671 -0.284331 -0.596224 0.174844 0.188467 -0.019223 0.162793
polarizability: 1.45186989e+02 -7.32527004e+00 1.94003513e+02 1.87294140e+01 2.43980809e+00 8.81202809e+01
1716.lowfreq: -5.5188 -0.0004 -0.0001 0.0004 2.0381 6.2346 29.7359 36.2365 60.0954
frequency: 29.5369 36.2222 60.0510 66.4011 88.8257 139.5904 174.6391 190.1694 226.0142 247.8415 254.9661 285.5708 292.5176 315.2050 336.1675 345.4136 357.5155 385.5702 436.6774 470.9367 482.7586 552.9220 575.5100 579.2554 597.7697 625.0785 651.6657 704.6434 705.5713 743.0987 780.1877 786.3010 820.4120 863.0600 935.8706 976.8743 992.8285 1047.8766 1081.5719 1100.2415 1130.9820 1142.6296 1186.4871 1207.5103 1231.6313 1247.2270 1290.5802 1304.0963 1325.7576 1344.2665 1366.1137 1384.5296 1395.7774 1464.6697 1494.5727 1594.8052 1618.8262 1636.1012 1643.0543 3004.1880 3063.3669 3077.6570 3119.8733 3139.0070 3464.6746 3498.4326 3574.4680 3578.0752 3599.0218
redmass: 6.8130 7.9904 7.9735 5.5137 7.7337 7.7906 6.7663 6.8658 5.4459 3.5154 4.7215 2.5775 2.8044 2.6070 1.1537 2.1349 1.3942 3.2537 3.2919 3.7695 4.0550 2.9892 1.6068 2.8673 6.6462 1.5421 5.4398 4.0413 3.5286 5.1605 3.9051 4.7659 1.5401 1.4978 2.4586 2.6158 2.9480 2.1780 2.4526 3.3078 1.4335 1.3005 1.6822 1.4410 1.4807 1.5752 3.1173 1.5518 1.5763 1.7259 1.3296 3.3194 6.9465 1.1259 3.5874 6.4300 6.2400 1.2080 4.7273 1.0616 1.0887 1.0977 1.0915 1.0918 1.0446 1.0639 1.0659 1.0663 1.0991
irintensity: 0.5541 1.0474 1.1996 0.4623 0.6409 0.4534 0.3048 1.3105 1.3481 5.9517 3.7734 11.7632 41.5961 4.1334 68.3552 13.5226 135.1533 66.4104 1.0553 65.6793 1.2655 64.0742 170.3675 64.3971 13.5518 108.2801 13.4644 38.2276 0.1704 1.6084 14.4935 14.0607 14.1900 37.3117 23.0109 15.5782 66.4537 213.0772 162.7654 15.3503 168.5064 325.3058 5.6085 8.5444 17.7837 6.3098 48.1577 9.1152 11.2447 16.1133 9.3111 35.2387 31.7190 23.8235 139.5031 12.0073 30.1012 59.1923 146.9510 17.0177 3.0439 8.8392 5.2991 8.8298 5.0805 18.5697 45.4410 48.7292 6.6710
temp: 298.150 k
press: 1.00000 atm
elementType: 53 8 8 8 8 7 6 6 6 6 6 6 6 6 6 1 1 1 1 1 1 1 1 1 1
symmnumber: 1
zpe: 475346.4 jmol-1
zpe.correction: 0.181050 hartree
zpe.thermalcorrener: 0.196771 hartree
zpe.thermalcorrenthalpy: 0.197715 hartree
zpe.thermalcorrgfe: 0.135895 hartree
zpe.sumelectzpe: -714.978329 hartree
zpe.sumelectthermal: -714.962608 hartree
zpe.sumelectthermalent: -714.961664 hartree
zpe.sumelectthermalfe: -715.023483 hartree
dipole: -1.7261 -0.9685 0.8369
dipole: 2.1489
quadrupole: -83.6773 -110.0510 -99.8240
quadrupole: 2.2112 1.7236 -0.5264
quadrupole: 14.1735 -12.2003 -1.9732 2.2112 1.7236 -0.5264
hfenergy: -715.1593785 hartree
pointgroup: C01 [X(C9H10I1N1O4)]
dipole: -0.7536564 -0.1771151 -0.3397588 debye
dipolederiv: -0.0654746 0.1172339 -0.02362 0.1290533 -0.4168006 0.0820041 -0.0338405 0.1018369 -0.0356032 -0.2542166 0.4061627 -0.2077714 0.5028121 -1.3253516 0.201722 -0.229621 0.2037948 -0.3980046 -0.4143356 -0.0425952 -0.1566563 -0.0784363 -0.264165 -0.2261671 -0.2134166 -0.2256246 -1.1753759 -1.4446098 0.3057356 0.1972513 0.2351326 -0.1517608 -0.1576206 0.2855686 -0.1933801 -0.4030088 -0.4021252 -0.114815 -0.0503934 0.0767786 -0.8158096 0.2525741 -0.2310586 0.0550704 -0.716763 -0.6675529 0.0520186 0.0523448 0.1567091 -0.7460707 -0.2422151 0.009032 -0.2396363 -0.246832 -0.0197468 0.0442813 -0.0323037 -0.0141296 0.0363669 -0.0352761 -0.1257265 -0.0319948 0.0954041 0.5453302 0.062135 -0.0140595 0.0007787 0.2165469 0.0323092 0.1048654 0.0656672 0.0991127 0.0982963 0.143348 -0.049322 0.0615182 -0.3192574 0.0559707 -0.0898053 0.0455081 -0.0501486 -0.0795449 0.0806929 -0.088088 0.0098368 -0.12593 -0.0003 -0.0306538 -0.0253291 -0.1625161 0.005129 -0.2003904 -0.0074537 -0.3035754 0.8992155 -0.2439384 0.0447357 -0.3347437 -0.0974408 -0.0067609 -0.2908323 0.1265787 -0.6282473 1.2644952 -0.2694322 0.2467469 -0.323789 0.1169789 0.1647198 0.035264 0.208335 0.0424647 0.9750862 -0.0149603 0.4140222 0.1612155 1.4481533 -0.2007287 -0.0334876 0.0224003 0.3317899 -0.296243 -0.0478207 -0.0919808 0.0832293 -0.109856 1.3295143 -0.337544 -0.2788699 -0.1175547 -0.0799065 0.0801698 -0.4061308 0.1577154 0.1136908 0.01188 -0.0131711 0.0422658 -0.041607 0.0240129 0.1356034 0.051928 0.0590743 -0.0266119 0.0334699 0.0119003 0.0018872 0.024551 -0.0330843 -0.0684836 -0.0111509 -0.0475222 0.0818078 0.0652628 0.0097101 0.0341146 0.0167252 0.0311294 0.0509457 0.0604235 0.0474438 -0.0319547 0.1086895 -0.0155373 0.0655759 -0.0243137 -0.0412638 0.072482 0.0653981 0.0662251 0.1246536 -0.0044761 -0.0503759 0.0730567 -0.0602387 0.0536148 0.0602064 0.081703 0.0583296 0.1210421 0.1706631 0.0094827 0.0044301 -0.0386942 0.2039266 0.1800479 0.024727 0.1223286 0.1758228 0.0704163 -0.028283 -0.0400435 -0.1120243 0.3332823 -0.0197108 -0.0497482 0.004517 0.0906951 0.1362954 -0.1103852 0.126494 -0.0834734 0.4002142 0.0078327 0.1170198 0.0180629 0.3323834 0.392158 0.0004586 -0.0127761 -0.0235734 0.072191 -0.0072649 0.0005892 0.0581424 0.3192676 0.4277474 -0.0410066 0.0066232 -0.0622821 0.1055612 0.1213217 0.0063737 0.1138585 0.3351034 unknown
polarizability: 158.6181831|-23.4923228|177.5410047|-10.4094868|-22.2819674|91.1515947 unknown
InChI: InChI=1S/C9H10INO4/c10-5-3-8(13)7(12)2-4(5)1-6(11)9(14)15/h2-3,6,12-14H,1,11H2
charge 0 multiplicity 1
25 atoms
I  0.229181 3.437848 -0.54566
O  2.545096 -2.363888 0.7452
O  -2.61839 -1.156513 -1.912368
O  4.108332 -0.509716 -0.467913
O  -2.307029 -1.958373 0.24629
N  -3.722973 0.917529 0.266345
C  -1.350366 0.775696 0.976568
C  -2.371004 0.505975 -0.158597
C  0.09095 0.505235 0.577582
C  0.655872 -0.773177 0.843818
C  0.929571 1.447765 -0.065437
C  1.978128 -1.108843 0.495086
C  -2.387043 -0.984638 -0.540985
C  2.262069 1.137551 -0.421295
C  2.79812 -0.138376 -0.144835
H  -1.619796 0.140273 1.841386
H  -1.491049 1.829478 1.27314
H  -2.098304 1.091563 -1.051848
H  0.016812 -1.525037 1.325041
H  2.888843 1.889194 -0.913954
H  -4.083295 0.411896 1.081939
H  -4.406697 1.003483 -0.490492
H  1.881835 -2.960148 1.17497
H  -2.69324 -2.128403 -2.119565
H  4.585075 0.240523 -0.903417
