program: Gaussian 09
title: 000133109
version: EM64L-G09RevD.01
frameworkgroup: C1[X(C15H16N4O2)]
method: RPBEPBE
basis: SDD
operation: Freq
keyword: #p
keyword: freq=noraman
keyword: PBEPBE/SDD
title: #p freq=noraman PBEPBE/SDD
converged: YES YES NO NO
title: Mulliken charges:
elementType: O O N N N N C C C C C C C C C C C C C C C H H H H H H H H H H H H H H H H
charge: -0.229131 -0.225074 -0.485737 -0.150219 -0.105815 -0.590059 0.461942 0.363121 0.377132 -0.466624 -0.636757 -0.528209 0.299561 0.115660 0.093123 -0.493676 0.278323 -0.785670 -0.795031 -0.035830 -0.776572 0.333707 0.277338 0.291043 0.318423 0.227044 0.244702 0.244348 0.260104 0.241379 0.241341 0.261284 0.231454 0.254623 0.231640 0.322797 0.334317
chargesum: 0.00000
title: Mulliken charges with hydrogens summed into heavy atoms:
elementType: O O N N N N C C C C C C C C C C C C C C C
charge: -0.229131 -0.225074 -0.167314 -0.150219 -0.105815 0.067055 0.461942 0.363121 0.377132 -0.132918 -0.359419 -0.237167 0.299561 0.115660 0.093123 -0.266632 0.278323 -0.036516 -0.051028 -0.035830 -0.058855
polarizability: 3.24764555e+02 -8.57263102e-01 2.46819204e+02 -2.77647821e-02 -2.40578040e-01 9.18306817e+01
1716.lowfreq: -81.3048 -3.3782 -0.0005 -0.0003 0.0002 2.5680 3.7291 24.2478 36.1140
frequency: -81.3035 24.1713 36.0748 55.5203 57.2487 62.6313 117.0012 124.4723 158.3636 163.0131 164.0624 171.0158 180.7398 196.9076 218.0319 226.0683 264.5801 285.5408 303.9552 324.8483 387.4550 434.2634 435.6344 456.0001 461.6879 503.9409 510.8432 530.4770 536.3021 571.2395 577.4174 577.4410 592.6010 612.9504 641.0470 644.4960 658.9676 676.9860 709.3870 719.1221 775.6006 830.7447 831.6872 893.5228 922.7578 931.8598 938.2250 942.0802 959.4757 962.0336 976.6526 986.7305 1005.1799 1028.9085 1032.6601 1047.4574 1065.2060 1093.5264 1101.9379 1114.9434 1184.4643 1225.1846 1227.5139 1263.6378 1283.1909 1335.3362 1344.1889 1369.3394 1373.7234 1388.9211 1404.0168 1409.4047 1427.5550 1445.3018 1449.0256 1454.0006 1461.2631 1461.5128 1463.0180 1468.3475 1487.6418 1512.2184 1554.8469 1571.0783 1587.3896 1587.7957 1610.4550 1612.7272 1623.8571 2984.0866 2988.3725 2988.8707 3068.6447 3068.8968 3071.9575 3120.6572 3121.3063 3125.6249 3127.6017 3150.2647 3163.4352 3189.3194 3539.3984 3561.7735 3720.8977
redmass: 1.0242 4.7986 4.5832 4.2497 4.8919 5.3505 6.0451 5.4431 5.4578 1.1710 1.1309 2.6081 3.6136 4.1269 5.7417 4.2304 3.9052 3.7296 3.0943 5.1059 5.4529 3.7876 3.8823 1.2009 3.7705 3.3146 3.9004 1.1138 5.4625 4.5600 2.4524 5.7248 4.7275 2.0242 5.1800 2.3008 2.4690 3.9861 1.9968 5.5098 4.6717 1.6785 6.8561 4.1061 6.4275 1.4698 1.5450 2.5734 1.3676 1.9051 2.3903 3.2145 2.3257 1.8601 1.8629 1.5889 2.8209 2.0887 1.8535 1.9126 1.5205 2.1520 2.6817 1.6151 2.8316 6.1983 2.8526 1.2583 1.2946 1.2904 5.6416 3.4302 3.2672 1.6152 1.1042 1.8356 1.0496 1.0495 1.3748 1.0462 2.8075 3.1956 5.8873 3.4943 4.4136 3.7787 2.4967 3.3827 5.2214 1.0373 1.0375 1.0380 1.0968 1.0973 1.0965 1.0913 1.0985 1.0994 1.0997 1.0930 1.0912 1.0923 1.0756 1.0442 1.1057
irintensity: 0.4118 0.0453 0.0205 11.4462 0.7410 0.8348 0.2389 6.0723 2.3375 0.3194 0.2540 3.0944 2.6623 10.2932 0.0009 0.7170 2.9308 0.6941 6.4258 2.5304 0.2856 11.5670 0.6451 254.5902 1.3790 8.3837 2.2715 22.7931 8.5960 24.6702 1.3981 21.5874 13.4728 28.4002 0.9677 23.5858 18.0969 0.0017 18.0504 0.8045 3.7728 62.8127 2.1304 1.9391 14.3166 29.2375 30.5087 41.3862 11.6135 18.4515 4.0758 6.8065 3.3823 0.1531 0.5472 9.1110 8.7943 12.6073 1.2403 4.4432 36.6530 87.0566 233.8305 6.4217 30.0863 221.3174 26.2865 31.8463 109.8330 33.5921 33.0048 22.5183 4.6934 168.5771 28.6007 127.0762 26.4656 14.3595 227.7997 17.4748 30.8543 317.1610 974.9545 116.7339 202.5059 140.3361 284.7564 224.0884 37.2905 3.8771 1.8101 16.5526 10.0804 17.7285 9.4198 14.2883 10.2140 19.2333 18.9618 5.2003 2.5801 25.2445 20.7675 89.6528 49.3810
temp: 298.150 k
press: 1.00000 atm
elementType: 8 8 7 7 7 7 6 6 6 6 6 6 6 6 6 6 6 6 6 6 6 1 1 1 1 1 1 1 1 1 1 1 1 1 1 1 1
symmnumber: 1
zpe: 755990.6 jmol-1
zpe.correction: 0.287942 hartree
zpe.thermalcorrener: 0.307661 hartree
zpe.thermalcorrenthalpy: 0.308605 hartree
zpe.thermalcorrgfe: 0.238698 hartree
zpe.sumelectzpe: -949.183612 hartree
zpe.sumelectthermal: -949.163893 hartree
zpe.sumelectthermalent: -949.162949 hartree
zpe.sumelectthermalfe: -949.232856 hartree
dipole: -3.6619 0.3145 0.0051
dipole: 3.6754
quadrupole: -126.6446 -121.2457 -125.9404
quadrupole: -0.6500 -0.0583 -0.1909
quadrupole: -2.0344 3.3645 -1.3301 -0.6500 -0.0583 -0.1909
hfenergy: -949.4715539 hartree
pointgroup: C01 [X(C15H16N4O2)]
dipole: 1.4389394 0.1353817 -0.0455374 debye
polarizability: 324.2935239|2.6520822|242.897768|-10.1324662|24.3134363|96.2231489 unknown
InChI: InChI=1S/C15H16N4O2/c1-8-4-14(19-15(16)17-8)18-13-6-11(9(2)20)5-12(7-13)10(3)21/h4-7,18H,16H2,1-3H3
charge 0 multiplicity 1
37 atoms
O  -3.838954 -3.154468 -0.418753
O  -3.393477 3.200759 0.557683
N  0.808499 -1.215588 -0.332899
N  2.26825 0.6626 -0.084043
N  4.700308 0.349668 -0.246728
N  3.760678 2.450723 0.151303
C  -0.46326 -0.615757 -0.17678
C  -2.907022 -0.95341 -0.115705
C  -1.971556 1.28854 0.194382
C  -0.66028 0.774025 0.052179
C  -1.594234 -1.465935 -0.258149
C  -3.095879 0.428893 0.111318
C  2.096063 -0.674696 -0.300676
C  -4.056771 -1.923885 -0.213729
C  -2.214329 2.7561 0.436442
C  3.206192 -1.549808 -0.498304
C  4.5014 -0.98962 -0.46365
C  -5.476577 -1.395786 -0.061369
C  -1.016168 3.694316 0.534645
C  3.568378 1.106418 -0.067171
C  5.737786 -1.837632 -0.663901
H  0.224594 1.408404 0.11144
H  -1.490357 -2.544953 -0.433181
H  -4.089608 0.871779 0.227412
H  0.783096 -2.224044 -0.496742
H  3.064648 -2.620921 -0.67174
H  -5.704556 -0.644621 -0.840352
H  -5.61271 -0.900213 0.917682
H  -6.184791 -2.233418 -0.146967
H  -0.4224 3.672951 -0.398402
H  -0.345983 3.39169 1.360866
H  -1.375668 4.718744 0.713754
H  5.721576 -2.338571 -1.649362
H  6.63417 -1.202111 -0.602581
H  5.807447 -2.628081 0.106066
H  2.960289 3.060688 0.289338
H  4.711404 2.809625 0.167175
