program: Gaussian 09
title: 000133114
version: EM64L-G09RevD.01
frameworkgroup: C1[X(C13H17NO8S)]
method: RPBEPBE
basis: SDD
operation: Freq
keyword: #p
keyword: freq=noraman
keyword: PBEPBE/SDD
title: #p freq=noraman PBEPBE/SDD
converged: YES YES NO NO
title: Mulliken charges:
elementType: S O O O O O O O O N C C C C C C C C C C C C C H H H H H H H H H H H H H H H H H
charge: 0.995214 -0.298608 -0.285767 -0.281359 -0.589507 -0.183643 -0.214859 -0.583037 -0.542663 -0.033984 -0.538206 0.439321 0.162045 -0.025127 -0.560831 -0.470171 0.287606 0.259498 0.054200 -0.608165 -0.555701 -0.521308 -0.496645 0.292683 0.343352 0.298900 0.302549 0.295919 0.272482 0.236628 0.372776 0.285000 0.232786 0.231588 0.214317 0.233136 0.260398 0.261722 0.230654 0.226805
chargesum: 0.00000
title: Mulliken charges with hydrogens summed into heavy atoms:
elementType: S O O O O O O O O N C C C C C C C C C C C C C
charge: 0.995214 -0.298608 -0.285767 -0.281359 -0.216731 -0.183643 -0.214859 -0.583037 -0.542663 -0.033984 0.097830 0.439321 0.162045 -0.025127 -0.261931 -0.167622 0.287606 0.259498 0.054200 0.196864 0.193673 0.186542 0.222537
polarizability: 3.16081569e+02 9.30267844e-01 2.48955799e+02 5.39496415e+00 1.46400573e+00 1.42578590e+02
1716.lowfreq: -8.7834 -6.0505 -4.1429 -0.0024 0.0002 0.0008 20.4705 26.5332 33.0958
frequency: 20.3856 26.5032 33.0316 38.0941 48.8577 56.5991 62.2196 72.2041 77.1533 86.2157 98.2795 106.4508 110.3528 126.3693 132.8748 139.4591 164.7650 175.5586 187.8357 199.7037 205.4097 225.4200 226.9552 238.2274 266.3872 277.1891 291.1102 300.9389 302.7220 311.3122 356.9982 365.9115 382.2829 404.1562 423.6276 442.9635 474.5054 506.6141 510.4249 527.5975 566.9404 580.3044 597.8335 631.6142 706.4046 728.2837 753.3777 760.2240 795.6264 822.7812 858.3867 863.4104 869.4028 911.6325 919.2525 932.1352 953.1287 976.2934 1014.7027 1024.8608 1064.3057 1079.6012 1100.6082 1105.9605 1108.3890 1109.4050 1122.1115 1132.7437 1144.6535 1156.7242 1164.3393 1188.8048 1218.7993 1271.6712 1285.7759 1328.1561 1356.6035 1379.2055 1409.6900 1415.0025 1426.5177 1437.4241 1445.3363 1450.2736 1452.5302 1458.6673 1465.7065 1467.9793 1468.5724 1472.0444 1482.0935 1483.6375 1492.1594 1536.0836 1569.5180 1598.6453 1608.5410 2976.6613 2977.0066 3000.1258 3005.5039 3075.0078 3085.4674 3099.5607 3105.6097 3112.5894 3130.2242 3132.5443 3140.0556 3141.8001 3153.8126 3176.1244 3222.6219 3484.0775
redmass: 5.5601 5.4269 5.3980 2.2923 3.7993 6.2716 2.6480 2.7031 2.2293 2.8022 2.7086 7.0046 5.7477 4.1147 3.0543 2.3024 1.3995 2.5224 1.9310 2.9535 3.1352 2.4210 4.5115 3.7536 6.7524 2.0639 4.1131 4.4933 4.8929 6.2238 5.0166 7.4234 4.7500 8.7174 3.2328 4.2060 6.1303 6.6696 6.6163 13.9981 5.2632 5.3871 4.8194 4.4046 5.7408 7.4748 4.5806 6.0302 5.7790 9.4878 1.7636 1.8011 5.1993 1.5806 5.9859 5.7664 8.1937 2.2045 3.2253 1.3590 5.1179 1.7019 1.7572 1.2326 1.2669 1.2394 1.2790 1.2571 1.3942 1.4184 1.4224 5.5247 1.9733 1.8064 2.4737 5.6047 3.2471 4.2439 2.4944 1.1837 1.3570 1.5339 1.2435 1.1144 1.3596 1.1172 1.2345 1.0493 1.0654 1.5123 1.0549 1.1917 1.0857 7.6661 7.2172 5.9484 9.0719 1.0321 1.0339 1.0308 1.0362 1.1047 1.0983 1.0552 1.0996 1.1019 1.1044 1.1022 1.1025 1.1060 1.0924 1.0923 1.1206 1.0664
irintensity: 0.0367 4.9263 1.4811 1.9671 6.8948 2.6162 3.6829 4.8333 2.8647 2.9720 5.5443 4.9121 13.5114 13.9765 4.5407 8.8643 6.6332 10.9358 54.4595 5.6780 27.9586 0.6445 17.0611 11.4544 49.6962 0.8960 10.9594 28.9254 5.2986 23.9106 19.0279 1.5756 6.0550 28.7647 1.1047 7.5014 11.1505 9.0860 12.0026 150.2530 33.3350 5.7218 3.6767 4.1165 9.6672 27.0471 46.0068 34.5018 37.6772 43.8388 22.1176 19.9325 18.7204 32.3246 33.6477 161.6531 40.0684 37.1300 186.5641 45.9962 123.8106 299.4736 82.2023 7.6023 0.5662 6.3879 10.9299 18.9780 17.6912 19.0265 26.0194 9.8313 46.9605 60.3168 73.8780 473.6792 230.7956 68.1037 89.8208 25.6562 38.0139 115.0403 8.8890 37.6734 31.9463 23.0791 182.6532 17.8656 42.6855 53.5460 15.9882 32.4996 69.2581 276.9453 91.4317 17.6017 122.5621 67.1081 50.7028 74.0366 12.3952 19.3973 33.8796 7.6760 17.6295 30.7662 16.9665 23.2309 0.1686 14.5965 20.5748 3.4058 4.8750 49.3345
temp: 298.150 k
press: 1.00000 atm
elementType: 16 8 8 8 8 8 8 8 8 7 6 6 6 6 6 6 6 6 6 6 6 6 6 1 1 1 1 1 1 1 1 1 1 1 1 1 1 1 1 1
symmnumber: 1
zpe: 764098.8 jmol-1
zpe.correction: 0.291030 hartree
zpe.thermalcorrener: 0.318321 hartree
zpe.thermalcorrenthalpy: 0.319265 hartree
zpe.thermalcorrgfe: 0.230527 hartree
zpe.sumelectzpe: -1558.210172 hartree
zpe.sumelectthermal: -1558.182881 hartree
zpe.sumelectthermalent: -1558.181937 hartree
zpe.sumelectthermalfe: -1558.270675 hartree
dipole: 0.5954 1.4192 1.6660
dipole: 2.2681
quadrupole: -128.7243 -135.0138 -150.6978
quadrupole: 18.9381 6.5398 -15.5474
quadrupole: 9.4210 3.1315 -12.5526 18.9381 6.5398 -15.5474
hfenergy: -1558.5012023 hartree
pointgroup: C01 [X(C13H17N1O8S1)]
dipole: -0.298991 -0.5856579 0.6032046 debye
polarizability: 316.0466408|-2.3857713|248.7671888|4.9715681|5.2712964|142.8021289 unknown
InChI: InChI=1S/C13H16NO5.HO3S/c1-14(2)13(16)11(15)8-6-9(17-3)12(19-5)10(7-8)18-4;1-4(2)3/h6-7H,1H2,2-5H3;1H
charge 0 multiplicity 1
40 atoms
S  3.86317 -1.206694 0.884685
O  -1.685164 -2.436516 -0.022236
O  -4.378355 1.639723 0.1730
O  -4.225358 -1.150984 0.083527
O  4.612478 -1.921256 -0.683044
O  2.078807 0.937511 -1.612104
O  0.469769 3.318242 0.043611
O  2.258089 -1.515051 0.910827
O  4.740602 -1.756385 2.138205
N  2.870433 1.518809 0.521308
C  4.078083 0.920543 0.250758
C  -0.71093 1.191928 -0.096609
C  1.834264 1.41889 -0.47963
C  0.474267 2.057128 -0.133776
C  -1.990031 1.787681 0.057986
C  -0.5822 -0.224822 -0.144593
C  -1.727091 -1.037673 -0.052225
C  -3.139098 0.984928 0.126349
C  -3.030753 -0.443066 0.03518
C  2.557518 1.990535 1.896138
C  -0.364116 -3.079489 -0.158902
C  -5.29243 1.298382 1.285787
C  -4.40209 -2.39076 -0.709994
H  4.925084 1.181462 0.893366
H  4.272358 0.696598 -0.804761
H  -2.090739 2.875466 0.102508
H  0.409932 -0.681454 -0.208336
H  2.021616 2.948664 1.844535
H  1.938739 1.242657 2.423444
H  3.498859 2.130218 2.450224
H  4.874539 -2.867803 -0.489751
H  0.331315 -2.754344 0.635532
H  -0.568612 -4.156691 -0.074197
H  0.080862 -2.852222 -1.145834
H  -4.81982 1.546492 2.255771
H  -6.176576 1.934003 1.128031
H  -5.569644 0.232306 1.257074
H  -3.853047 -3.227064 -0.254342
H  -5.48845 -2.566433 -0.694574
H  -4.05528 -2.233459 -1.74654
