program: Gaussian 09
title: 000133086
version: EM64L-G09RevD.01
frameworkgroup: C1[X(C10H18BrNO6)]
method: RPBEPBE
basis: SDD
operation: Freq
keyword: #p
keyword: freq=noraman
keyword: PBEPBE/SDD
title: #p freq=noraman PBEPBE/SDD
converged: YES YES NO NO
title: Mulliken charges:
elementType: Br O O O O O O N C C C C C C C C C C H H H H H H H H H H H H H H H H H H
charge: -0.048879 -0.273664 -0.268190 -0.258087 -0.275073 -0.409135 -0.245023 -0.335006 -0.235788 -0.253545 -0.220824 -0.395768 -0.247715 -0.242772 0.292794 -0.290372 -0.789612 0.209989 0.175050 0.212985 0.185123 0.198907 0.189827 0.221510 0.235567 0.232020 0.207448 0.180113 0.182861 0.219358 0.383983 0.231073 0.242330 0.290565 0.312350 0.385599
chargesum: 0.00000
title: Mulliken charges with hydrogens summed into heavy atoms:
elementType: Br O O O O O O N C C C C C C C C C C
charge: -0.048879 -0.273664 -0.268190 -0.258087 -0.275073 -0.023536 -0.245023 0.048977 0.152247 0.130486 0.190513 0.071818 0.139845 0.159447 0.292794 0.183032 -0.186697 0.209989
polarizability: 1.57851115e+02 -1.50098946e-01 1.65397619e+02 -9.43433514e+00 1.25366484e+01 1.30287048e+02
1716.lowfreq: -6.2136 -1.8700 0.0003 0.0004 0.0006 3.9899 11.6601 18.1564 29.0412
frequency: 11.4475 17.9270 29.0152 32.1629 45.6429 52.5281 60.1152 70.8110 88.3957 110.8424 112.6919 131.3884 146.3112 153.1256 167.2348 195.1393 223.4004 264.1043 293.1215 297.0785 316.1948 330.1353 404.5679 415.1269 461.6565 488.5273 508.9725 542.2606 551.8651 600.5699 624.1222 659.1374 686.5717 730.1104 774.7021 790.0638 833.9726 839.9328 879.6136 889.2482 918.5380 933.0628 948.5409 991.3915 1008.1672 1027.7085 1034.7352 1060.2001 1065.5174 1076.6366 1078.9646 1096.5792 1099.9164 1116.0410 1126.9756 1137.8898 1190.3505 1198.6271 1205.6908 1213.5952 1227.0846 1248.5201 1252.7121 1269.6150 1273.0889 1289.6372 1332.8360 1341.5739 1354.1899 1366.6467 1388.6635 1401.9701 1415.0510 1423.9407 1435.1715 1444.2654 1449.6501 1457.6578 1466.1462 1471.8819 1479.7027 1520.8498 1607.9478 1672.9479 2918.2316 2921.1491 2923.6353 2929.8258 2938.8811 2944.5077 2984.2130 2988.0589 2991.9275 2996.7093 3001.5746 3003.4036 3025.6417 3068.4947 3089.6932 3173.2419 3459.1316 3514.8373
redmass: 7.3035 3.8769 11.1339 9.4504 7.3469 6.4071 8.5799 5.3211 2.8222 5.0952 4.3990 3.9044 4.1290 4.8009 3.7478 4.1197 2.7388 3.2802 2.8699 4.4957 2.6667 2.3711 2.7910 3.9856 3.6293 2.3699 2.8472 3.2355 2.7805 3.2107 4.0058 1.5983 1.2276 4.5460 2.5751 2.5147 2.3861 3.1582 3.8152 2.0535 2.1914 2.1527 2.5714 1.9440 2.9566 2.4754 2.6705 2.6236 2.4682 3.1230 1.8845 3.0897 2.5950 3.3203 1.9663 2.0009 1.0731 1.1042 1.1260 1.1461 1.1723 1.1268 1.1207 1.6030 1.9186 1.3294 1.2111 1.2752 1.4529 1.3057 1.3708 1.5151 1.5779 1.1346 1.1106 1.0814 1.0836 1.0821 1.0869 1.0860 1.0826 1.7198 6.4250 8.7601 1.0577 1.0588 1.0602 1.0595 1.0584 1.0586 1.1023 1.1020 1.0967 1.0983 1.1026 1.1036 1.0627 1.0572 1.1044 1.1102 1.0815 1.0641
irintensity: 0.4673 0.4150 1.7324 4.3612 2.0193 1.5811 0.4741 2.5109 3.3407 13.3371 3.8730 13.0733 2.5901 1.4310 11.0442 2.2110 4.3519 7.7040 4.5175 0.1563 4.4388 0.7579 13.7885 14.0406 4.0990 9.0551 23.6812 17.7571 7.6679 22.9367 10.4289 140.6944 134.8688 9.2924 5.4245 7.5604 0.5620 10.5610 1.2952 6.7736 4.0423 26.8349 17.4549 63.6935 48.6303 6.6412 9.0112 197.3450 174.6957 124.6065 25.9572 18.7786 42.8428 48.4716 5.0027 18.7242 2.4794 0.5810 4.0176 14.7950 10.9353 4.4680 4.1851 28.8103 12.8137 46.8279 27.2968 12.5520 7.9419 3.8803 5.2030 2.5099 9.5453 25.6589 23.3347 17.2360 8.7692 13.3420 21.1438 8.7623 6.7373 150.4334 241.7943 274.6105 12.8472 16.4317 43.2746 72.0083 134.4242 139.1343 54.5799 55.0726 48.6471 25.9634 84.7606 16.0564 56.0564 9.6716 8.7116 0.5057 242.7309 31.1149
temp: 298.150 k
press: 1.00000 atm
elementType: 35 8 8 8 8 8 8 7 6 6 6 6 6 6 6 6 6 6 1 1 1 1 1 1 1 1 1 1 1 1 1 1 1 1 1 1
symmnumber: 1
zpe: 746612.6 jmol-1
zpe.correction: 0.284370 hartree
zpe.thermalcorrener: 0.305550 hartree
zpe.thermalcorrenthalpy: 0.306494 hartree
zpe.thermalcorrgfe: 0.228452 hartree
zpe.sumelectzpe: -909.929218 hartree
zpe.sumelectthermal: -909.908038 hartree
zpe.sumelectthermalent: -909.907094 hartree
zpe.sumelectthermalfe: -909.985136 hartree
dipole: -3.2032 4.4532 -1.3420
dipole: 5.6473
quadrupole: -101.9059 -111.3787 -115.9194
quadrupole: 12.6312 -10.1693 0.8909
quadrupole: 7.8288 -1.6441 -6.1847 12.6312 -10.1693 0.8909
hfenergy: -910.2135879 hartree
pointgroup: C01 [X(C10H18Br1N1O6)]
dipole: 1.8399086 1.0123474 -0.7255122 debye
polarizability: 165.6382187|1.7964692|159.8706114|12.7594796|3.380813|128.0269524 unknown
InChI: InChI=1S/C10H18BrNO6/c11-7-9(13)12-1-2-16-3-4-17-5-6-18-8-10(14)15/h12,14H,1-8H2
charge 0 multiplicity 1
36 atoms
Br -0.045612 -2.022499 2.364381
O  -1.891326 1.856472 -0.631115
O  0.501109 2.889178 0.785524
O  2.340221 0.776067 -0.298722
O  -3.336342 -2.38932 0.529957
O  3.377998 -2.583746 -0.938667
O  1.24628 -1.70037 -1.162919
N  -1.724939 -1.173113 -0.643869
C  -1.872009 2.951931 0.337624
C  -0.5535 3.693122 0.16133
C  -3.036662 0.955517 -0.472287
C  -2.726584 -0.309297 -1.283743
C  1.828762 3.082607 0.209511
C  2.683504 1.886941 0.603749
C  -2.118925 -2.148855 0.242167
C  3.005056 -0.454826 0.078146
C  -0.993396 -2.991712 0.839062
C  2.416223 -1.590371 -0.740447
H  -2.725259 3.646354 0.161472
H  -1.943166 2.559047 1.374649
H  -0.606969 4.695369 0.640581
H  -0.358368 3.825302 -0.92402
H  -3.963441 1.438252 -0.856103
H  -3.190952 0.691979 0.594982
H  -3.654047 -0.897581 -1.397548
H  -2.359548 -0.01145 -2.281609
H  1.776144 3.140766 -0.898628
H  2.292626 4.019356 0.59312
H  3.76367 2.134935 0.504399
H  2.469738 1.609901 1.657925
H  -0.724681 -0.996827 -0.803012
H  4.101211 -0.415497 -0.090433
H  2.828553 -0.703002 1.150524
H  -0.197718 -3.217365 0.114095
H  -1.415759 -3.893116 1.300485
H  2.973911 -3.356446 -1.419863
