program: Gaussian 09
title: 000133160
version: EM64L-G09RevD.01
frameworkgroup: C1[X(C20H34O2)]
method: RPBEPBE
basis: SDD
operation: Freq
keyword: #pfreq=noraman
keyword: PBEPBE/SDD
title: #p freq=noraman PBEPBE/SDD
converged: YES YES NO NO
title: Mulliken charges:
elementType: O O C C C C C C C C C C C C C C C C C C C C H H H H H H H H H H H H H H H H H H H H H H H H H H H H H H H H H H
charge: -0.436636 -0.249368 -0.369907 -0.388865 -0.375692 -0.307385 -0.466261 -0.470599 -0.476544 -0.360504 -0.193300 -0.200952 -0.176318 -0.696072 -0.176586 -0.534361 -0.475267 -0.382127 -0.147011 -0.196076 -0.477922 0.204961 0.233947 0.193386 0.191911 0.201355 0.197436 0.193767 0.188461 0.173910 0.193014 0.199799 0.203006 0.202423 0.204381 0.201955 0.189806 0.193476 0.243390 0.223146 0.220121 0.209408 0.201860 0.241594 0.219423 0.211370 0.208438 0.202825 0.238549 0.224673 0.199496 0.221850 0.222121 0.245279 0.263437 0.393776
chargesum: 0.00000
title: Mulliken charges with hydrogens summed into heavy atoms:
elementType: O O C C C C C C C C C C C C C C C C C C C C
charge: -0.042860 -0.249368 0.057426 0.004402 0.015511 0.054986 -0.073448 -0.065170 -0.070208 0.022778 0.050090 0.022194 0.043803 -0.043210 0.042837 -0.114554 -0.033893 0.042042 0.075111 0.025775 0.030793 0.204961
polarizability: 2.40392738e+02 -4.80294875e+00 2.43961766e+02 -3.77319207e+00 -1.98141870e+00 1.93605461e+02
1716.lowfreq: -11.7032 -8.6941 -0.0005 0.0005 0.0006 3.8261 12.8694 19.6888 29.4860
frequency: 12.6289 19.4748 29.2887 31.2053 37.6670 40.9458 52.0400 57.2124 59.5224 83.0138 85.9934 92.1042 98.7260 122.2425 133.0266 156.1024 160.1039 168.5236 179.2829 190.2023 203.6839 233.4118 241.2211 249.1365 263.6730 278.6135 306.5232 325.2868 350.5013 379.6723 391.4685 420.4712 447.0983 469.7473 482.6541 492.1063 501.2817 512.8024 525.7290 587.5457 667.5968 732.5838 739.4203 742.2414 772.2234 775.8699 785.5220 805.4908 829.1797 832.5779 848.2406 856.9940 879.7231 895.9074 920.4028 923.0423 933.6320 941.5269 971.6731 973.6206 979.9759 980.6806 992.3994 1000.0335 1002.3474 1029.7308 1035.6983 1036.6189 1055.9208 1056.5836 1071.3710 1082.9955 1088.3275 1098.7752 1102.8512 1107.7356 1114.3312 1136.2986 1159.7975 1173.2672 1180.0948 1191.1328 1198.7264 1205.0097 1211.9461 1240.2996 1246.0005 1252.9512 1255.6945 1261.1483 1263.3419 1272.6219 1274.4922 1283.3131 1283.9291 1286.7531 1296.8786 1298.6290 1299.3865 1306.3079 1316.3426 1333.6791 1334.3609 1337.6502 1344.7750 1349.3241 1350.6527 1352.8661 1370.1083 1397.3686 1431.3381 1448.4134 1455.4432 1458.4325 1459.9308 1461.4693 1462.9559 1464.9463 1468.3219 1471.5047 1480.7005 1481.3872 1485.4316 1495.8583 1656.3943 1679.5388 1680.2490 1688.4191 2928.0387 2935.2300 2949.5776 2953.5425 2957.3722 2960.4663 2965.1337 2969.0639 2969.1888 2971.9472 2973.9187 2976.8970 2984.9869 2998.2656 3000.7922 3008.9813 3013.0427 3018.8743 3019.1663 3027.9748 3032.0458 3038.6573 3045.0957 3048.9960 3059.8510 3059.8723 3062.4070 3065.9356 3067.9347 3070.9336 3077.7570 3078.4286 3080.8887 3465.9173
redmass: 4.3357 4.1194 4.7639 4.7755 4.9152 6.5519 3.8162 4.6795 3.5094 2.2567 2.5996 2.0243 2.7753 2.2438 2.3186 2.1980 2.3716 2.8704 2.5264 2.2692 2.1862 2.3490 3.1583 1.1209 2.9732 2.7760 2.5870 2.7290 3.0166 2.4290 2.6638 2.5504 2.5664 2.7500 2.7460 2.2850 2.6539 2.2459 2.6359 3.4978 1.2431 1.1331 1.6640 1.0895 1.3273 1.4541 1.8462 1.6216 1.6024 2.3833 1.9182 2.0427 2.2289 1.5699 1.5483 1.9184 2.0423 2.1287 1.1812 1.4773 1.4309 1.1336 1.7377 2.2826 1.7557 3.2282 2.4247 2.1754 2.1258 2.0544 2.3477 2.1625 2.1232 2.0719 1.7314 2.3301 1.9921 1.8166 1.8606 1.2594 1.5157 1.3743 1.2712 1.3512 1.4466 1.2896 1.4463 1.2923 1.3245 1.2308 1.2663 1.2257 1.1766 1.1201 1.1644 1.2725 1.2463 1.2075 1.2710 1.3150 1.3406 1.4111 1.3971 1.4496 1.4568 1.5508 1.4399 1.4840 1.6962 1.2077 1.0922 1.0907 1.0915 1.0844 1.0921 1.0938 1.0789 1.0854 1.0930 1.0628 1.0985 1.0414 1.0636 1.0854 8.0837 6.5278 6.4409 6.6914 1.0569 1.0657 1.0601 1.0599 1.0594 1.0617 1.0604 1.0598 1.0636 1.0613 1.0394 1.0962 1.0622 1.0643 1.0969 1.0992 1.0995 1.1010 1.0993 1.0923 1.1033 1.0951 1.1031 1.0961 1.0926 1.0947 1.0936 1.0974 1.0996 1.0877 1.1003 1.0884 1.0892 1.0643
irintensity: 0.2008 0.2724 0.6957 0.1658 0.2092 0.1390 0.2392 0.4594 0.1719 0.4458 0.4088 0.4648 0.1666 0.1276 0.6786 0.2304 0.8186 2.1936 0.2994 0.3170 0.4168 2.1773 3.4084 0.3824 1.4145 1.1866 3.5163 1.7797 0.9229 1.4566 0.5664 10.2787 0.1358 11.2774 8.8136 1.2486 3.4453 10.3822 1.3170 12.1438 91.6164 7.3767 16.2648 6.3847 1.7032 0.7428 5.4139 0.8340 2.6191 4.8912 1.7552 1.6178 12.9494 1.8314 6.8376 2.9242 2.9162 3.1656 19.9591 79.9409 43.9546 54.1314 38.2931 7.0829 6.1854 7.0248 92.1833 113.7840 1.4227 9.4533 28.9091 0.4995 4.7872 5.7363 5.2398 22.1751 6.4783 8.9479 3.9895 0.2586 0.5423 1.5502 1.1020 2.1934 1.9454 0.6698 8.0222 4.0688 0.6315 8.9960 2.2011 1.6061 1.0336 0.7255 0.4493 0.0785 0.4789 1.3615 2.6414 5.5452 1.4218 1.1278 4.5376 0.8758 1.2705 1.5602 2.7839 8.1409 33.0510 10.2596 30.9111 13.9939 12.6916 13.2034 3.4431 13.9723 0.3776 2.3918 16.2100 2.0870 13.3718 14.7010 7.2154 17.6723 173.8822 0.5207 0.4164 0.1010 58.9318 37.8920 22.6851 19.3895 34.4003 52.3874 5.1166 126.8870 33.8537 75.8432 20.7037 2.4503 41.8584 27.7413 20.5156 13.3029 28.2701 9.0050 22.4494 7.0473 79.7628 11.0314 66.1503 2.1664 35.6940 8.7929 14.4139 34.8591 76.0322 12.2165 45.7573 85.5914 50.9639 142.7432
temp: 298.150 k
press: 1.00000 atm
elementType: 8 8 6 6 6 6 6 6 6 6 6 6 6 6 6 6 6 6 6 6 6 6 1 1 1 1 1 1 1 1 1 1 1 1 1 1 1 1 1 1 1 1 1 1 1 1 1 1 1 1 1 1 1 1 1 1
symmnumber: 1
zpe: 1293574.9 jmol-1
zpe.correction: 0.492697 hartree
zpe.thermalcorrener: 0.520009 hartree
zpe.thermalcorrenthalpy: 0.520953 hartree
zpe.thermalcorrgfe: 0.430432 hartree
zpe.sumelectzpe: -931.171790 hartree
zpe.sumelectthermal: -931.144477 hartree
zpe.sumelectthermalent: -931.143533 hartree
zpe.sumelectthermalfe: -931.234054 hartree
dipole: 0.2718 1.0583 -0.8224
dipole: 1.3675
quadrupole: -131.4660 -140.5293 -134.5409
quadrupole: -1.2944 -6.4087 5.6541
quadrupole: 4.0461 -5.0172 0.9712 -1.2944 -6.4087 5.6541
hfenergy: -931.6644863 hartree
pointgroup: C01[X(C20H34O2)]
dipole: -0.1669524 0.3758247 0.3469327 debye
polarizability: 239.3929649|4.3503216|244.6489436|-2.6226903|5.1783881|193.9180567 unknown
InChI: InChI=1S/C20H34O2/c1-2-3-4-5-6-7-8-9-10-11-12-13-14-15-16-17-18-19-20(21)22/h6-7,12-13,15-16,21H,2-5,8-11,14,17-19H2,1H3
charge 0 multiplicity 1
56 atoms
O  0.558512 -0.946968 1.092217
O  0.414803 -2.959391 -0.057524
C  0.02844 2.821504 0.433293
C  4.798013 0.118769 -0.02355
C  -1.007613 3.96495 0.346256
C  3.637982 -0.605529 -0.741339
C  1.194887 3.158836 1.404464
C  4.377345 0.774896 1.324285
C  -2.093329 3.750538 -0.74413
C  4.030625 -1.238241 -2.09608
C  2.146184 1.997998 1.611785
C  3.423751 1.940975 1.148872
C  -3.009845 2.571791 -0.481161
C  2.832183 -1.900896 -2.811165
C  -3.206472 1.531639 -1.331541
C  -4.143364 0.357721 -1.094949
C  -2.8437 -3.269757 -0.109506
C  -2.156059 -3.555629 1.255954
C  -3.402509 -0.970716 -1.050449
C  -3.600779 -1.956527 -0.137158
C  -1.222851 -2.424366 1.733136
C  -0.033103 -2.187811 0.821408
H  -0.466907 1.883889 0.752371
H  0.44848 2.623677 -0.574334
H  5.213375 0.898605 -0.694988
H  5.618056 -0.603578 0.164837
H  -0.479999 4.91832 0.135333
H  -1.497699 4.092508 1.334235
H  2.809575 0.117164 -0.907617
H  3.253991 -1.413466 -0.079409
H  0.759413 3.46106 2.380476
H  1.748377 4.03756 1.016664
H  5.294199 1.126759 1.841341
H  3.917412 0.008051 1.979954
H  -2.705378 4.675379 -0.808174
H  -1.60323 3.625927 -1.730394
H  4.471923 -0.456892 -2.74836
H  4.827785 -1.990669 -1.927674
H  1.739585 1.137691 2.167159
H  3.82077 2.802903 0.586224
H  -3.556296 2.588302 0.476606
H  3.145125 -2.395933 -3.748865
H  2.062422 -1.147997 -3.067826
H  2.350484 -2.657134 -2.164243
H  -2.64815 1.513532 -2.281878
H  -4.884053 0.326101 -1.924704
H  -4.719282 0.504733 -0.161648
H  -3.539512 -4.109079 -0.316994
H  -2.0826 -3.281356 -0.911247
H  -1.584979 -4.499292 1.174556
H  -2.930696 -3.708276 2.033444
H  -4.35524 -1.808578 0.654182
H  -2.645272 -1.123851 -1.836534
H  -0.821111 -2.653556 2.740803
H  -1.768912 -1.468738 1.826928
H  1.341343 -0.791051 0.492759
