program: Gaussian 09
title: 000133070
version: EM64L-G09RevD.01
frameworkgroup: C1[X(C18H16N2O2)]
method: RPBEPBE
basis: SDD
operation: Freq
keyword: #p
keyword: freq=noraman
keyword: PBEPBE/SDD
title: #p freq=noraman PBEPBE/SDD
converged: YES YES NO NO
title: Mulliken charges:
elementType: O O N N C C C C C C C C C C C C C C C C C C H H H H H H H H H H H H H H H H
charge: -0.223994 -0.224254 -0.214835 -0.429190 0.180677 -0.591487 -0.303962 0.346938 0.135246 0.369786 0.082135 0.270184 -0.651204 -0.354538 -0.380714 -0.419736 -0.422911 -0.292996 -0.238968 -0.246324 -0.242327 -0.245197 0.274591 0.259090 0.294455 0.248534 0.240216 0.270041 0.327672 0.266730 0.262505 0.265847 0.220695 0.237010 0.236172 0.230311 0.230384 0.233417
chargesum: 0.00000
title: Mulliken charges with hydrogens summed into heavy atoms:
elementType: O O N N C C C C C C C C C C C C C C C C C C
charge: -0.223994 -0.224254 -0.214835 -0.101518 0.180677 -0.057806 -0.009507 0.346938 0.135246 0.369786 0.082135 0.270184 0.107586 -0.087808 -0.118209 -0.153888 -0.202216 -0.055986 -0.002795 -0.016013 -0.011943 -0.011779
polarizability: 2.50053520e+02 8.66776503e+00 2.26848508e+02 1.10875956e+01 5.62852794e-01 1.44513830e+02
1716.lowfreq: 0.0006 0.0008 0.0008 6.1804 9.2110 11.5927 53.0112 61.5731 69.2479
frequency: 52.9927 61.5447 69.2353 84.6441 103.9109 121.7554 135.1485 155.0864 186.5983 235.6212 257.8462 269.4641 277.0370 301.6245 308.6266 341.2813 362.3806 364.1231 412.4514 426.9964 454.8803 493.2317 506.3008 531.5988 556.8570 595.4734 614.8462 617.1473 634.5561 646.5410 661.1624 701.3341 714.2530 724.2091 754.0278 763.3192 770.2080 776.1033 786.8878 860.8722 864.7653 870.9571 892.0870 907.1401 934.9982 955.3082 963.5379 984.2411 989.1400 991.6463 999.6674 1006.2675 1015.1563 1033.6038 1051.3279 1073.5407 1080.2024 1090.6606 1111.7607 1128.6428 1161.6553 1174.5016 1182.8191 1187.2348 1194.0852 1209.4975 1218.5310 1227.8569 1256.6591 1275.0139 1284.3360 1314.5988 1320.3280 1327.3729 1349.6614 1375.4348 1378.7308 1420.4834 1421.7337 1437.0115 1460.1540 1473.2541 1475.3905 1482.0960 1493.6216 1494.4105 1583.0007 1590.1912 1610.7841 1612.1150 1624.2019 1652.9352 2980.0783 3037.8187 3067.3464 3097.3121 3103.9664 3108.2574 3113.9835 3125.5920 3131.0267 3139.3731 3143.4113 3150.7348 3152.0527 3166.3445 3170.6210 3472.4858
redmass: 6.1921 4.2028 5.0079 4.9390 4.2485 1.1442 6.0915 3.5423 4.0549 6.2438 4.4890 3.5439 3.2753 4.8803 4.1203 5.8046 5.6580 4.7509 2.9460 4.7950 4.5854 6.0266 3.4781 3.5478 4.2073 3.7395 5.5572 6.3760 5.8748 6.1538 5.2449 3.1654 1.7655 2.3965 3.4334 2.0431 1.8463 2.1783 2.4145 3.6025 1.4311 1.4078 3.8042 3.7848 1.4392 1.5589 2.5933 1.3597 1.9591 2.5076 1.5464 2.3358 2.7874 2.1263 2.6816 2.6011 2.1657 1.8889 2.1763 1.3361 1.5082 1.0521 1.1227 2.1551 1.2375 2.0363 2.8137 2.1502 2.3241 1.8028 1.6628 1.6617 1.4314 2.2482 3.6225 6.1763 6.4420 1.4999 1.4581 2.2001 2.3836 1.0459 1.0965 2.1970 1.9130 1.1601 7.2656 6.2960 6.0282 6.0457 3.9435 7.9752 1.0366 1.0608 1.0968 1.0931 1.0992 1.1007 1.0887 1.0847 1.0874 1.0870 1.0917 1.0956 1.0934 1.1015 1.1007 1.0742
irintensity: 1.2593 0.5910 0.6167 0.6865 0.6317 0.4921 1.8073 0.8190 0.7837 0.1888 0.4086 5.2226 1.5590 3.5783 2.1794 9.5233 5.1406 5.2010 0.3469 3.6580 15.1454 13.9644 8.4470 9.0652 0.7377 3.2425 10.2197 0.5311 9.9383 5.9937 0.9656 20.6745 38.4075 5.3632 7.0246 38.8616 19.1539 67.4950 58.0833 9.3565 5.0301 5.1212 11.2869 7.7785 3.0318 11.4044 12.5700 0.8301 0.3002 0.4223 2.8800 10.2050 27.5853 5.1265 2.4636 2.9788 29.4518 11.4318 47.3134 0.9297 22.3727 0.1265 2.6991 2.5413 3.6108 18.1333 16.0152 27.5266 43.6079 39.7830 7.9105 18.7537 5.2878 29.7111 188.4823 48.7942 24.3852 36.4173 54.8463 19.6246 54.7241 9.5202 10.6889 22.1194 51.4117 1.8904 61.0544 8.9501 7.1636 8.4515 167.2681 568.0277 33.7533 12.3064 25.0636 2.3853 8.6789 2.7069 11.5656 3.0900 0.7038 0.6843 18.4812 36.5262 7.5190 22.3392 19.8754 19.5287
temp: 298.150 k
press: 1.00000 atm
elementType: 8 8 7 7 6 6 6 6 6 6 6 6 6 6 6 6 6 6 6 6 6 6 1 1 1 1 1 1 1 1 1 1 1 1 1 1 1 1
symmnumber: 1
zpe: 789935.7 jmol-1
zpe.correction: 0.300871 hartree
zpe.thermalcorrener: 0.318444 hartree
zpe.thermalcorrenthalpy: 0.319388 hartree
zpe.thermalcorrgfe: 0.256032 hartree
zpe.sumelectzpe: -953.954814 hartree
zpe.sumelectthermal: -953.937240 hartree
zpe.sumelectthermalent: -953.936296 hartree
zpe.sumelectthermalfe: -953.999653 hartree
dipole: 4.7638 5.1538 -0.4776
dipole: 7.0345
quadrupole: -130.3419 -130.3438 -129.2633
quadrupole: -20.7137 0.0626 2.5197
quadrupole: -0.3589 -0.3608 0.7197 -20.7137 0.0626 2.5197
hfenergy: -954.2556843 hartree
pointgroup: C01[X(C18H16N2O2)]
dipole: -1.9273792 -1.9830818 -0.1096629 debye
polarizability: 250.9324041|7.4490345|226.0745713|-9.4260266|-4.9312334|144.4088819 unknown
InChI: InChI=1S/C18H16N2O2/c1-20-17(22)13-11-18(20,12-7-3-2-4-8-12)14-9-5-6-10-15(14)19-16(13)21/h2-10,13,19H,11H2,1H3
charge 0 multiplicity 1
38 atoms
O  1.742843 2.857866 1.451291
O  3.771851 1.548802 -1.479565
N  0.081488 1.23434 1.024231
N  2.67217 -0.32811 -0.7432
C  -0.345661 0.321904 -0.088241
C  0.185329 1.105993 -1.33954
C  1.428543 1.859924 -0.837372
C  0.363875 -1.034895 0.129165
C  1.134015 2.081521 0.670755
C  -1.876483 0.234894 -0.236362
C  2.70034 1.047848 -1.03451
C  1.748634 -1.253678 -0.170496
C  -0.243274 0.980088 2.43359
C  -0.338003 -2.078945 0.789021
C  -2.467959 -0.782794 -1.02897
C  -2.706775 1.268502 0.265554
C  2.326134 -2.524929 0.124446
C  0.246108 -3.321807 1.098048
C  1.593838 -3.550512 0.743323
C  -3.856055 -0.782262 -1.287768
C  -4.096756 1.266292 0.014537
C  -4.679992 0.238005 -0.759886
H  -0.584594 1.82969 -1.651488
H  0.384146 0.429333 -2.186411
H  1.598485 2.830603 -1.325588
H  0.163407 0.005799 2.76534
H  -1.333946 0.980888 2.596535
H  0.221892 1.781893 3.029941
H  3.596753 -0.7360 -0.927367
H  -1.384596 -1.90647 1.058828
H  -1.842382 -1.576766 -1.451332
H  -2.259243 2.090251 0.835546
H  3.381507 -2.69532 -0.12492
H  -0.339565 -4.095572 1.603978
H  2.075775 -4.509965 0.958184
H  -4.292218 -1.576674 -1.903631
H  -4.72135 2.071416 0.417341
H  -5.757577 0.236947 -0.957105
