program: Gaussian 09
title: 000133091
version: EM64L-G09RevD.01
frameworkgroup: C1[X(C22H23N3O2S)]
method: RPBEPBE
basis: SDD
operation: Freq
keyword: #p
keyword: freq=noraman
keyword: PBEPBE/SDD
title: #p freq=noraman PBEPBE/SDD
converged: YES YES NO NO
title: Mulliken charges:
elementType: S O O N N N C C C C C C C C C C C C C C C C C C C C C C H H H H H H H H H H H H H H H H H H H H H H H
charge: 0.202653 -0.253642 -0.253414 -0.093763 -0.427731 -0.429413 -0.326422 -0.662587 0.458230 0.220270 -0.203697 -0.374862 0.226016 -0.384260 -0.411957 0.063483 -0.243403 -0.168420 0.064415 -0.613994 -0.615972 -0.370939 0.434094 -0.384088 -0.388472 -0.232094 -0.238743 -0.238665 0.201026 0.228663 0.278924 0.264646 0.267982 0.242190 0.232013 0.348888 0.245624 0.250851 0.350590 0.194233 0.220468 0.229545 0.192288 0.225572 0.229798 0.268197 0.240988 0.235625 0.231876 0.232787 0.234603
chargesum: 0.00000
title: Mulliken charges with hydrogens summed into heavy atoms:
elementType: S O O N N N C C C C C C C C C C C C C C C C C C C C C C
charge: 0.202653 -0.253642 -0.253414 -0.093763 -0.078843 -0.078824 0.103268 -0.119017 0.458230 0.220270 -0.203697 -0.106881 0.226016 -0.142070 -0.179943 0.063483 0.002221 0.082432 0.064415 0.030253 0.031686 -0.102743 0.434094 -0.143100 -0.152846 -0.000218 -0.005956 -0.004062
polarizability: 7.50193629e+02 -6.30187178e+01 2.99677598e+02 1.54627543e+01 1.86856372e+01 1.56425794e+02
1716.lowfreq: 0.0012 0.0015 0.0019 0.5184 1.6947 3.7894 13.5362 15.7882 22.2664
frequency: 12.5231 15.7057 21.9730 29.6154 35.5764 49.0597 54.0262 71.0828 75.8187 83.6040 106.4417 119.2122 145.3187 151.6445 160.0080 180.8359 200.7062 210.7499 221.1151 227.0233 234.9465 251.8868 278.7013 298.7875 316.1915 339.3555 362.4630 399.8707 406.1082 407.9233 432.9395 437.2643 447.4875 460.9750 472.8936 483.5745 524.3045 537.0952 549.0579 565.1687 613.7202 617.2559 629.6809 665.1517 673.9404 698.1863 701.4447 712.2469 720.7233 731.4321 750.9009 755.9063 760.1535 773.0450 792.6552 818.9542 825.6358 834.3955 841.1105 845.0985 853.5441 894.1262 905.0006 917.8817 932.7072 955.9780 970.6201 977.4239 987.9410 994.1589 997.8865 999.3320 1024.2586 1028.2291 1035.5308 1067.3557 1079.2764 1089.4286 1089.8283 1118.0382 1125.3971 1144.9008 1145.9118 1175.5377 1184.7874 1197.3749 1205.2672 1218.0061 1229.7744 1233.1702 1263.7786 1268.1327 1303.4628 1304.7000 1309.4136 1313.3165 1327.3063 1352.7451 1368.1245 1375.8476 1381.7914 1386.2216 1407.4415 1417.2851 1421.0003 1426.8851 1442.8053 1443.2294 1452.7453 1462.1910 1468.8242 1476.1961 1481.0249 1484.9006 1486.0939 1486.2387 1547.9132 1575.6989 1589.5518 1602.4817 1606.6389 1613.6570 1644.7519 1647.9877 2858.7923 2862.9042 2877.7579 3023.4302 3023.9822 3030.4781 3041.0086 3081.6750 3086.2562 3108.6561 3124.8854 3126.2639 3126.5794 3129.2792 3129.7388 3129.9429 3140.6105 3150.8146 3151.4577 3165.4420 3167.8479 3501.1151 3505.3376
redmass: 5.4551 6.2005 5.2993 2.9663 4.3645 3.9237 6.6593 5.0236 5.2445 3.4779 7.4192 2.3373 6.7065 5.4435 4.8053 4.4477 4.4342 3.5094 1.1074 2.4837 2.8464 2.7356 5.6231 4.8556 4.6725 4.0415 2.8933 4.2557 2.9124 2.9726 3.6303 3.1934 3.8063 5.0508 10.6002 4.4689 2.8513 5.1636 3.7668 6.1950 6.3746 6.4498 6.8779 4.3357 1.9577 1.9667 6.4291 3.0270 4.3570 4.6079 3.5382 2.1605 1.8195 2.4266 1.2255 3.3874 1.6437 1.3105 4.2411 3.3406 1.3180 1.3737 1.4891 3.0290 1.5190 1.3444 1.3812 1.5895 3.6330 1.3811 1.3399 3.4807 2.5056 2.2061 1.5656 2.8749 3.5088 1.2802 1.6682 1.3092 1.7487 1.9646 1.7103 1.0618 2.7514 1.1467 1.1989 1.7545 1.7359 1.8071 1.5589 2.2204 3.2925 1.3637 2.3078 1.4189 1.3808 3.6143 1.3393 5.8835 2.6575 1.8346 2.5924 3.2125 1.1383 2.3758 1.1562 2.2166 1.1033 1.0513 1.0612 1.0505 1.0913 2.3133 1.3217 1.6127 6.0952 5.5855 7.4611 6.0753 6.0800 5.3603 5.5211 7.5162 1.0566 1.0631 1.0632 1.0606 1.0715 1.0719 1.0880 1.1011 1.1006 1.1089 1.0854 1.0879 1.0878 1.0881 1.0880 1.0880 1.0915 1.0963 1.0969 1.0939 1.1016 1.0760 1.0759
irintensity: 0.5300 0.2053 0.0682 0.2661 0.0916 0.4207 0.4420 0.2300 0.3551 0.7463 2.7845 2.2242 2.3581 1.1568 0.3724 1.1214 1.1837 0.4030 0.8815 0.7285 0.7003 1.1364 1.9952 0.4809 7.3198 1.1520 2.5573 45.5030 3.8570 0.0590 50.1170 2.8746 0.6144 1.2148 3.2392 13.2367 42.0931 16.8807 4.6879 7.6638 1.5702 4.9853 1.4811 9.8339 10.6099 66.2240 33.3385 2.1709 4.8218 20.3768 20.8999 15.7255 111.6550 42.4136 16.2632 23.2272 28.4631 6.1497 16.9398 13.4265 3.3887 21.9618 36.3883 88.7236 16.1102 1.4430 1.4073 0.8412 0.4749 4.0572 0.1174 23.4876 33.8413 6.6158 28.2583 70.8859 147.5460 4.1067 7.1028 21.3037 3.1334 17.3432 3.8846 0.0620 1.0964 5.3758 33.1657 1.8271 23.4059 27.8540 17.9285 4.1268 917.4286 124.7456 10.4695 35.9035 56.3454 128.8856 1.2717 140.5072 35.6198 226.2172 238.7202 12.3658 3.9926 19.4108 7.0821 13.0106 20.2373 18.6593 7.1690 19.2743 21.3409 40.7947 32.7848 25.5379 2.4596 8.2395 146.1494 233.6773 84.3534 322.7846 8.4869 20.1675 72.3599 103.1150 231.7535 11.2552 30.0675 47.1565 12.9406 20.5696 59.1850 20.8143 9.0082 3.1070 2.5908 1.7269 14.8202 6.6438 5.2339 33.5666 15.3891 6.5173 41.1221 47.8709 18.9549
temp: 298.150 k
press: 1.00000 atm
elementType: 16 8 8 7 7 7 6 6 6 6 6 6 6 6 6 6 6 6 6 6 6 6 6 6 6 6 6 6 1 1 1 1 1 1 1 1 1 1 1 1 1 1 1 1 1 1 1 1 1 1 1
symmnumber: 1
zpe: 1062307.7 jmol-1
zpe.correction: 0.404612 hartree
zpe.thermalcorrener: 0.431433 hartree
zpe.thermalcorrenthalpy: 0.432378 hartree
zpe.thermalcorrgfe: 0.342922 hartree
zpe.sumelectzpe: -1562.893992 hartree
zpe.sumelectthermal: -1562.867171 hartree
zpe.sumelectthermalent: -1562.866226 hartree
zpe.sumelectthermalfe: -1562.955682 hartree
dipole: -2.2511 -1.4634 0.8954
dipole: 2.8304
quadrupole: -112.7762 -182.7325 -175.3443
quadrupole: 2.5453 -1.0548 -2.7490
quadrupole: 44.1748 -25.7815 -18.3933 2.5453 -1.0548 -2.7490
hfenergy: -1563.2986039 hartree
pointgroup: C01 [X(C22H23N3O2S1)]
dipole: 0.913315 0.021581 -0.6366942 debye
polarizability: 743.5523064|22.1949151|210.3208031|82.3847345|73.4947917|252.4239114 unknown
InChI: InChI=1S/C22H23N3O2S/c1-25(2)12-13-28-18-10-8-17(9-11-18)15-20-22(27)23-19(21(26)24-20)14-16-6-4-3-5-7-16/h3-11,14-15,23-24H,12-13H2,1-2H3
charge 0 multiplicity 1
51 atoms
S  6.167452 0.631477 1.774434
O  -2.682128 1.929631 2.509547
O  -1.560409 -1.829655 -1.313807
N  8.491471 -0.631885 -1.412292
N  -0.837445 -0.326428 0.296344
N  -3.386394 0.540371 0.792191
C  8.10232 -0.2318 -0.040692
C  6.583946 0.020863 0.030088
C  1.493407 1.092057 1.826202
C  -0.988488 0.690857 1.265892
C  4.350927 0.796302 1.718979
C  0.048562 1.274851 1.961883
C  -3.221942 -0.386077 -0.260549
C  2.321645 1.406411 2.949231
C  2.154828 0.660513 0.635773
C  -2.385104 1.108634 1.589289
C  3.715443 1.255088 2.905371
C  3.555046 0.515233 0.580706
C  -1.839875 -0.914901 -0.480707
C  8.623382 0.512105 -2.338663
C  9.678866 -1.510596 -1.448659
C  -4.241098 -0.873154 -1.04868
C  -5.663294 -0.51431 -1.067846
C  -6.593697 -1.486113 -1.547578
C  -6.177651 0.760692 -0.674983
C  -7.975393 -1.217096 -1.591754
C  -7.560883 1.030763 -0.728552
C  -8.469093 0.042041 -1.173941
H  8.65739 0.67404 0.310982
H  8.357047 -1.055785 0.650553
H  6.038638 -0.915995 -0.166458
H  6.268997 0.794872 -0.689751
H  -0.293832 1.954693 2.752273
H  1.85061 1.762955 3.87284
H  1.591138 0.507409 -0.291715
H  0.093247 -0.733319 0.161911
H  4.316989 1.495322 3.789054
H  4.012878 0.195491 -0.359663
H  -4.33901 0.813102 1.05382
H  9.474059 1.190366 -2.07505
H  7.69827 1.11383 -2.345657
H  8.786356 0.139547 -3.365428
H  10.61634 -1.009772 -1.098112
H  9.847586 -1.856169 -2.484359
H  9.506697 -2.40038 -0.818084
H  -3.918294 -1.670711 -1.729423
H  -6.217055 -2.462747 -1.874359
H  -5.496417 1.574989 -0.401975
H  -8.667709 -1.984563 -1.954858
H  -7.929578 2.019692 -0.434579
H  -9.542945 0.254758 -1.20989
