program: Gaussian 09
title: 000133030
version: EM64L-G09RevD.01
frameworkgroup: C1[X(C5H9O6P)]
method: RPBEPBE
basis: SDD
operation: Freq
keyword: #pfreq=noraman
keyword: PBEPBE/SDD
title: #p freq=noraman PBEPBE/SDD
converged: YES YES NO NO
title: Mulliken charges:
elementType: P O O O O O O C C C C C H H H H H H H H H
charge: 1.385350 -0.501342 -0.258919 -0.664722 -0.707101 -0.183372 -0.580883 -0.578567 -0.361156 0.267601 0.236278 -0.752710 0.262812 0.260354 0.299394 0.271856 0.265780 0.261344 0.249687 0.421644 0.406672
chargesum: 0.00000
title: Mulliken charges with hydrogens summed into heavy atoms:
elementType: P O O O O O O C C C C C
charge: 1.385350 -0.501342 -0.258919 -0.243078 -0.300429 -0.183372 -0.580883 -0.055401 0.210094 0.267601 0.236278 0.024101
polarizability: 1.30299622e+02 -1.29936297e+00 8.81527066e+01 1.23594656e+00 2.70237616e-01 7.50672080e+01
1716.lowfreq: -4.9317 0.0013 0.0013 0.0026 2.9461 9.8589 21.2672 34.9407 55.5823
frequency: 20.6129 34.8675 55.5736 71.3671 124.0226 138.5345 148.4033 165.1470 200.3116 223.7004 248.3292 301.5607 302.2589 335.5012 355.8949 382.6451 430.0505 476.2059 485.7252 561.5057 587.0168 643.0439 669.5565 749.4922 774.9970 786.1397 809.5484 907.7975 961.7317 969.0423 986.9842 1025.5358 1033.9697 1071.9979 1092.4580 1157.2936 1206.8811 1227.9406 1243.2029 1249.0945 1341.9555 1373.6518 1411.7135 1437.6655 1447.5486 1450.2112 1603.6925 1648.8740 2976.6564 2983.1313 3031.0327 3045.5054 3064.1797 3114.3792 3119.6991 3131.4806 3616.1467
redmass: 3.7999 5.0401 8.1048 7.0052 8.3969 1.5899 1.2558 2.8504 6.1124 4.3755 3.5170 4.0425 8.9458 4.7797 6.9491 2.9244 3.6337 3.1232 3.7730 4.6936 3.8782 4.5354 6.4660 1.3124 3.3972 5.9950 3.8679 1.9285 1.7444 2.3601 1.2808 3.9187 2.1947 4.2752 1.6626 2.7856 1.1837 1.4156 1.5223 1.3951 1.4488 1.2401 1.0781 1.0810 1.0502 1.0834 7.7440 8.0915 1.0597 1.0377 1.0587 1.1004 1.0958 1.0677 1.1049 1.1004 1.0665
irintensity: 6.7815 0.5511 4.4531 1.2525 3.0474 35.7201 42.4791 46.1286 9.0262 2.7846 8.5993 4.3540 18.1288 56.5991 24.2773 1.5437 15.7199 1.3798 10.1564 13.0718 30.2495 32.2695 115.0727 186.1151 3.7232 226.7769 12.0569 39.5147 2.4955 31.8626 30.8536 178.9826 16.0408 136.5274 0.5940 420.7832 3.8291 258.7600 38.1945 44.7179 32.8164 63.0242 44.4945 36.4156 27.6577 2.2345 205.1209 57.9267 12.0414 0.4806 1.8939 7.4819 3.9547 721.2102 13.9940 6.0135 71.7974
temp: 298.150 k
press: 1.00000 atm
elementType: 15 8 8 8 8 8 8 6 6 6 6 6 1 1 1 1 1 1 1 1 1
symmnumber: 1
zpe: 382885.6 jmol-1
zpe.correction: 0.145833 hartree
zpe.thermalcorrener: 0.160262 hartree
zpe.thermalcorrenthalpy: 0.161207 hartree
zpe.thermalcorrgfe: 0.102712 hartree
zpe.sumelectzpe: -987.531453 hartree
zpe.sumelectthermal: -987.517023 hartree
zpe.sumelectthermalent: -987.516079 hartree
zpe.sumelectthermalfe: -987.574574 hartree
dipole: 6.0535 1.1255 5.0910
dipole: 7.9893
quadrupole: -79.7468 -84.9492 -75.9495
quadrupole: 8.2123 -9.4283 -4.0168
quadrupole: 0.4683 -4.7340 4.2657 8.2123 -9.4283 -4.0168
hfenergy: -987.677286 hartree
pointgroup: C01 [X(C5H9O6P1)]
dipole: -1.943394 -2.3386568 -0.7961663 debye
dipolederiv: 2.4682931 0.2362706 0.1208442 -0.1150625 1.8471721 -0.0615253 0.0842756 -0.1317028 1.691499 -1.3867609 -0.3844172 0.0703567 -0.5291439 -0.629609 0.0260272 0.0710839 0.1300427 -0.5356477 -0.869772 -0.2176485 0.0927316 -0.4818114 -0.4391833 0.2096464 0.4103005 0.1986505 -0.7845143 -1.0327249 -0.0535735 -0.2110955 -0.079027 -0.6677776 -0.0240361 -0.2048387 0.0360699 -0.8974792 -0.6517512 0.1231937 -0.0773372 0.3188048 -1.0995077 -0.0189668 -0.043078 -0.0173371 -0.6600324 -0.5881365 0.0837521 0.0188647 0.2323916 -0.3383259 -0.0816545 0.2813438 -0.0472355 -0.8539596 -0.6998444 -0.0787642 -0.0297698 -0.0163766 -0.6296884 0.0174122 -0.0243918 -0.0181767 -0.5448052 -1.2461292 -0.0213764 0.2156834 0.0362169 -0.1267407 -0.0435687 0.1237549 -0.0128256 -0.0255533 0.4382776 0.1656745 -0.0634976 0.5326411 0.4520333 0.0336753 -0.0227831 0.0336437 -0.1602686 1.1358966 0.3383542 -0.0048746 0.7808592 0.2994898 -0.2404074 -0.1153409 -0.215077 0.836044 1.1978096 -0.377705 0.0334567 -0.8762993 0.2956951 0.109418 -0.2911026 0.031256 1.0361598 -0.2318468 0.0928031 -0.1912542 0.1570915 -0.0064992 0.0681263 -0.2275163 0.0924108 -0.3155456 0.1269945 0.044096 -0.0331541 0.0220719 0.0377665 0.0438827 -0.021069 0.0758923 0.0249082 0.0750003 -0.0317937 -0.0339033 -0.0427891 0.0711071 -0.0258475 -0.0482171 -0.0605747 -0.0275414 0.0393892 -0.029805 0.0703282 -0.0856436 0.0878219 -0.0183226 0.0184792 -0.0015609 0.1250087 0.1049215 0.0243448 -0.0373286 -0.0976288 -0.0500259 0.0076129 -0.0377939 -0.0195049 0.1225708 0.0100762 0.0828677 0.0197645 0.1176445 0.0516488 -0.0270235 0.0383866 -0.0569594 0.0671193 0.0316753 -0.0556768 0.078808 0.0004735 0.0989497 0.0658081 0.0648671 0.0376659 0.0664821 0.0854332 -0.0251424 -0.0533125 -0.0640165 -0.0269394 -0.0556964 -0.0214245 -0.0465493 0.1093999 0.827539 0.1412755 -0.0149416 0.218589 0.4320978 0.0054589 -0.069956 -0.0183272 0.3335064 0.1656602 -0.0567294 0.029631 -0.028985 0.3405149 0.0099807 0.0350201 0.0101993 0.3926489 unknown
polarizability: 127.7179663|11.7916331|77.868977|0.4597952|-1.4915213|87.9325935 unknown
InChI: InChI=1S/C5H9O6P/c1-4(6)2-5(7)3-11-12(8,9)10/h8-9H,2-3H2,1H3
charge 0 multiplicity 1
21 atoms
P  2.699577 0.459287 0.274882
O  1.160575 0.487324 1.096622
O  -0.135379 -0.284049 -1.320917
O  2.308393 0.85073 -1.327028
O  2.941502 -1.264841 0.299839
O  -3.043796 -0.572029 1.559642
O  3.839419 1.32806 0.926364
C  -1.74621 -1.697238 -0.17412
C  0.245949 -0.6471 1.084174
C  -0.495256 -0.829335 -0.237855
C  -2.934357 -0.823704 0.335415
C  -3.877539 -0.297316 -0.724938
H  -1.603366 -2.516725 0.552008
H  -1.957073 -2.098015 -1.17732
H  -0.490356 -0.449781 1.886306
H  0.775964 -1.593833 1.318494
H  -4.605936 0.399921 -0.284763
H  -3.303779 0.207808 -1.525044
H  -4.417107 -1.137218 -1.203224
H  1.366791 0.54199 -1.561052
H  3.882084 -1.555735 0.201315
