program: Gaussian 09
title: 000133079
version: EM64L-G09RevD.01
frameworkgroup: C1[X(C21H27N3O3S)]
method: RPBEPBE
basis: SDD
operation: Freq
keyword: #p
keyword: freq=noraman
keyword: PBEPBE/SDD
title: #p freq=noraman PBEPBE/SDD
converged: YES YES NO NO
title: Mulliken charges:
elementType: S O O O N N N C C C C C C C C C C C C C C C C C C C C C H H H H H H H H H H H H H H H H H H H H H H H H H H H
charge: 0.937783 -0.271842 -0.549180 -0.549649 -0.077421 -0.172104 -0.711644 -0.353782 -0.352279 -0.358210 -0.448026 -0.404661 -0.384203 -0.145841 0.233193 0.288976 0.494505 -0.527306 -0.326037 -0.378260 -0.386979 -0.349828 -0.357195 -0.255352 -0.242332 -0.252509 -0.240846 -0.079891 0.197781 0.241306 0.204248 0.189422 0.185119 0.217451 0.243819 0.194749 0.213245 0.223256 0.227631 0.204834 0.216790 0.213988 0.237126 0.194388 0.224127 0.227380 0.235233 0.237139 0.226425 0.228900 0.229502 0.280136 0.273478 0.320493 0.332952
chargesum: 0.00000
title: Mulliken charges with hydrogens summed into heavy atoms:
elementType: S O O O N N N C C C C C C C C C C C C C C C C C C C C C
charge: 0.937783 -0.271842 -0.549180 -0.549649 -0.077421 -0.172104 -0.058199 0.085304 0.041391 0.044360 -0.009458 0.031839 0.048263 0.070948 0.233193 0.288976 0.494505 -0.076192 0.092478 -0.150879 -0.151746 -0.112688 -0.130770 -0.026451 -0.012830 0.027627 0.032632 -0.079891
polarizability: 3.97351875e+02 2.29534285e+01 2.49282389e+02 9.95872922e+00 1.48670870e+01 2.33022603e+02
1716.lowfreq: -2.3925 -0.9219 0.0009 0.0015 0.0018 7.7599 10.8963 13.3691 24.3035
frequency: 9.3601 12.7158 23.9403 27.4015 28.5463 46.3419 52.8844 69.5857 90.1375 104.0454 112.5379 113.5113 139.9556 160.1512 180.0651 187.0138 222.6138 230.5081 235.3026 260.9294 268.7968 277.0142 300.3862 303.8791 324.9291 350.8319 359.0837 373.6052 379.7717 404.6667 415.9695 420.5089 423.6385 441.8043 452.7363 460.1752 473.2404 476.0295 493.5411 527.0033 536.9870 572.0498 615.5654 619.6951 631.8828 655.6165 705.0236 716.0614 725.3536 743.0027 756.6336 775.3062 791.2690 795.2273 803.9085 815.1877 817.3211 820.7961 839.7567 854.3412 872.0461 895.6313 907.1256 916.7144 947.6946 949.4092 955.2766 964.5556 969.3338 975.6721 986.7210 988.9634 1005.6075 1031.7746 1043.0253 1050.0043 1057.1887 1064.5645 1067.3580 1069.5125 1081.5960 1084.2246 1096.7951 1125.0952 1128.7015 1137.2818 1149.2559 1168.9694 1175.3697 1189.3264 1196.3657 1201.9797 1205.4806 1218.8074 1219.8515 1232.7172 1248.1231 1263.1677 1274.2753 1285.7256 1293.5796 1299.8261 1304.7033 1308.3472 1325.9188 1335.2184 1347.4117 1348.9653 1361.5413 1366.2322 1372.5161 1378.5540 1380.4930 1384.2672 1399.9760 1430.4738 1437.9719 1444.7962 1453.7730 1455.2731 1461.2870 1463.3561 1467.1039 1468.5849 1484.0674 1485.4091 1495.8252 1531.9797 1573.0298 1587.7608 1606.4684 1613.2616 2846.2699 2855.5239 2878.0920 2898.3885 2937.2168 2946.7079 2950.2341 2978.0355 3008.4140 3034.2093 3039.4386 3048.4016 3048.9314 3068.5845 3072.2800 3080.6609 3104.5619 3115.8977 3122.9937 3139.7633 3152.1471 3153.5419 3160.7257 3174.8320 3179.0483 3352.7994 3520.4880
redmass: 5.7248 4.8984 4.9988 3.9757 4.7776 4.3991 3.2708 4.7919 3.7391 5.1150 4.0534 1.9180 3.4209 3.5054 3.4370 4.3380 3.1039 4.2058 2.3550 2.5755 2.4643 3.2186 4.0464 2.5803 4.3315 5.8774 4.4168 3.9065 4.4879 2.2799 2.9618 3.7877 4.7016 4.8002 3.7811 3.6631 3.0650 3.9012 3.6807 2.9495 3.6595 4.1702 2.7519 6.8137 3.0987 3.5253 4.1129 3.3366 3.7300 1.8662 1.4978 2.1527 2.6985 4.7814 1.3847 1.8990 2.7703 1.8525 1.6184 2.4189 1.4116 2.2227 4.3342 3.5775 1.9120 1.4122 1.5469 1.3684 2.2791 4.4562 1.3261 2.6313 2.6332 3.0953 2.3553 1.7944 2.0810 2.2262 1.4567 2.3487 2.4673 2.8553 2.3469 1.8826 1.4629 2.3685 2.8715 2.0312 1.0688 1.3162 1.9445 1.1759 1.1664 1.8530 1.4532 1.3962 1.3997 1.3787 1.2850 1.6176 1.2960 1.3659 1.3316 1.2544 1.3509 1.5145 1.4873 1.3048 1.3595 1.3899 1.7596 2.9760 3.8279 2.1451 1.4625 4.1416 2.2282 1.1443 1.0936 1.0811 1.1037 1.0864 1.0995 1.1167 1.5631 1.4161 2.6931 1.0873 7.1884 6.8726 5.9782 6.3794 1.0716 1.0702 1.0700 1.0821 1.0681 1.0707 1.0689 1.0601 1.0617 1.0998 1.0891 1.0884 1.0880 1.0921 1.1001 1.0968 1.0896 1.0865 1.0876 1.0933 1.0891 1.0882 1.1006 1.0944 1.0946 1.0414 1.0993
irintensity: 0.2415 0.9970 0.6784 0.4792 1.1239 1.9694 0.2221 1.4693 3.6472 3.2312 6.7585 22.4187 1.9306 7.6307 4.3004 4.3515 11.5052 10.6288 2.1122 4.9108 0.3382 7.5512 13.0592 3.8727 4.1680 8.7435 7.3377 0.3494 6.9122 4.8153 3.5855 3.7279 35.0558 66.1503 3.4300 6.0410 41.1130 93.7611 5.9428 56.5534 55.4710 8.6258 7.3880 0.7301 9.6485 9.7036 3.9064 3.2728 1.3796 39.2183 41.5960 5.4847 3.8672 34.0936 0.4917 252.3610 4.1578 54.1755 7.9933 6.1828 2.4033 9.8109 72.8258 46.1932 0.7193 1.9910 0.5414 0.1939 8.6782 10.6000 0.0367 6.2184 102.2857 25.7034 22.1382 7.8307 25.9654 41.3108 32.3425 41.4057 11.6507 19.8774 14.8294 2.8167 2.7196 80.2135 42.6242 9.6837 0.4745 3.3997 3.0074 10.3489 4.0147 4.4396 3.2746 26.8333 201.1690 21.6978 11.0012 5.4783 17.5976 26.2243 8.4982 13.4995 8.7080 5.6985 0.5743 7.5753 3.3393 2.1316 0.8557 14.2563 1.0069 94.3062 0.4364 2.5045 5.5337 15.5262 19.2263 5.6870 70.8195 7.7847 2.5630 4.1881 20.4119 10.5454 146.0667 14.4084 9.2716 1.2991 357.0909 1.7091 42.3342 57.1933 120.7764 46.8319 50.9306 74.4614 83.2395 26.2586 24.6546 38.7004 32.5505 26.2372 26.9566 15.5840 38.9535 41.1869 17.5559 11.9840 3.3302 32.9346 0.8876 2.1423 27.5115 10.8464 19.0886 20.2490 18.5346
temp: 298.150 k
press: 1.00000 atm
elementType: 16 8 8 8 7 7 7 6 6 6 6 6 6 6 6 6 6 6 6 6 6 6 6 6 6 6 6 6 1 1 1 1 1 1 1 1 1 1 1 1 1 1 1 1 1 1 1 1 1 1 1 1 1 1 1
symmnumber: 1
zpe: 1176907.6 jmol-1
zpe.correction: 0.448260 hartree
zpe.thermalcorrener: 0.475356 hartree
zpe.thermalcorrenthalpy: 0.476300 hartree
zpe.thermalcorrgfe: 0.386406 hartree
zpe.sumelectzpe: -1602.124992 hartree
zpe.sumelectthermal: -1602.097897 hartree
zpe.sumelectthermalent: -1602.096953 hartree
zpe.sumelectthermalfe: -1602.186847 hartree
dipole: -9.3309 2.4184 -1.2535
dipole: 9.7204
quadrupole: -219.2887 -169.5039 -168.0591
quadrupole: 16.6142 -4.9970 4.7674
quadrupole: -33.6715 16.1133 17.5582 16.6142 -4.9970 4.7674
hfenergy: -1602.5732527 hartree
pointgroup: C01 [X(C21H27N3O3S1)]
dipole: 3.6867915 1.0120044 0.0930044 debye
polarizability: 396.5219152|-19.3914184|236.2301531|19.1613925|-16.4502613|246.9047983 unknown
InChI: InChI=1S/C21H27N3O3S/c22-28(25,26)19-7-5-18(6-8-19)24-14-12-23(13-15-24)11-9-21-20-4-2-1-3-17(20)10-16-27-21/h1-8,21H,9-16,22H2
charge 0 multiplicity 1
55 atoms
S  -7.841629 0.518994 -0.083867
O  5.152974 -1.987801 0.456896
O  -8.373476 0.303651 -1.612167
O  -8.53274 -0.201798 1.20522
N  1.009533 -1.080287 0.020286
N  -1.861656 -0.623458 -0.020986
N  -7.955942 2.328759 0.305665
C  2.459878 -0.829527 0.227742
C  0.394911 -0.176437 -0.977634
C  0.236803 -0.9989 1.281334
C  3.314818 -1.34613 -0.946692
C  -1.066108 -0.571216 -1.266006
C  -1.21935 -1.431254 1.043995
C  4.83066 -1.157295 -0.720096
C  5.278587 0.303896 -0.559048
C  6.11265 0.705269 0.52223
C  -3.245409 -0.396264 -0.039636
C  6.581347 -0.316246 1.551269
C  6.509515 -1.735426 0.966126
C  4.899167 1.2641 -1.531664
C  6.519832 2.060091 0.616973
C  -3.945895 -0.155833 -1.269057
C  -4.012751 -0.372003 1.173969
C  5.307958 2.610037 -1.428147
C  6.119878 3.013415 -0.342295
C  -5.321846 0.13041 -1.284101
C  -5.386718 -0.08893 1.16529
C  -6.017922 0.166788 -0.065269
H  2.667125 0.255808 0.401625
H  2.774076 -1.37268 1.136355
H  0.958485 -0.234054 -1.925539
H  0.420282 0.888573 -0.628454
H  0.24733 0.037054 1.708112
H  0.692073 -1.680055 2.023221
H  3.119488 -2.42565 -1.077773
H  3.034645 -0.847566 -1.893497
H  -1.492351 0.18964 -1.940436
H  -1.084751 -1.554464 -1.786138
H  -1.226784 -2.503496 0.749555
H  -1.77716 -1.334431 1.986685
H  5.36692 -1.586281 -1.599587
H  7.613656 -0.085551 1.878684
H  5.937198 -0.271415 2.451763
H  7.25359 -1.861878 0.149466
H  6.679945 -2.509945 1.731765
H  4.277069 0.95772 -2.381203
H  7.16486 2.363841 1.451156
H  -3.426313 -0.222779 -2.227495
H  -3.53389 -0.549824 2.139744
H  5.0001 3.337344 -2.187529
H  6.445403 4.055696 -0.252706
H  -5.855447 0.28438 -2.227736
H  -5.962831 -0.077208 2.095885
H  -8.172994 2.832137 -0.571696
H  -8.701992 2.428684 1.016041
