program: Gaussian 09
title: 000011874
version: EM64L-G09RevD.01
frameworkgroup: C1[X(C7H6O5)]
method: RPBEPBE
basis: SDD
operation: Freq
keyword: #p
keyword: freq=noraman
keyword: PBEPBE/SDD
title: #p freq=noraman PBEPBE/SDD
converged: YES YES NO NO
title: Mulliken charges:
elementType: O O O O O C C C C C C C H H H H H H
charge: -0.383744 -0.486314 -0.473090 -0.460628 -0.221533 0.181943 0.069552 0.022797 -0.282257 0.212298 -0.355549 0.110128 0.283951 0.229516 0.390720 0.401940 0.379538 0.380732
chargesum: 0.00000
title: Mulliken charges with hydrogens summed into heavy atoms:
elementType: O O O O O C C C C C C C
charge: 0.006976 -0.084374 -0.093552 -0.079896 -0.221533 0.181943 0.069552 0.022797 0.001694 0.212298 -0.126033 0.110128
polarizability: 1.40762958e+02 4.60172652e+00 1.10811314e+02 -1.09489253e-02 -5.33913788e-03 3.78326826e+01
1716.lowfreq: -9.7468 -0.0007 -0.0004 0.0003 2.1180 10.5930 43.6774 94.5307 153.8612
frequency: 43.6748 94.5300 153.8609 184.8956 266.9826 267.4504 294.3905 301.6969 321.6845 342.9026 388.8213 402.7656 497.1487 518.4573 534.4431 560.8269 574.5096 585.5287 596.2331 658.6095 693.2089 717.6708 754.5552 789.2599 869.6499 945.2123 970.2080 1041.9035 1121.2546 1154.9877 1172.4258 1225.4764 1238.6613 1272.7942 1306.7897 1316.1467 1432.2989 1485.9586 1495.4331 1609.8219 1634.2102 1657.9352 3140.4452 3194.0192 3480.6733 3535.9130 3575.5944 3622.2279
redmass: 11.1842 6.9682 8.5916 8.0123 3.7186 4.9467 5.7164 2.2287 1.7913 9.1524 8.9090 1.1169 9.7942 2.3805 1.1376 5.9460 2.5999 3.7904 1.9840 6.0608 4.7367 7.5910 3.4922 1.9879 6.7250 1.3236 4.2952 2.7405 1.3359 1.4424 1.4551 2.1528 2.4978 2.0180 2.8108 1.9052 5.5438 3.7704 3.7958 7.3417 7.2405 8.6127 1.0906 1.0941 1.0647 1.0642 1.0656 1.0667
irintensity: 0.4357 0.7928 0.8875 1.3201 58.0982 5.3835 12.0741 36.3722 84.6798 3.2256 0.4940 181.2152 4.3487 6.3603 154.2685 37.1759 55.6293 48.9224 51.4219 20.8466 52.6689 11.4750 39.1309 17.5227 177.5128 1.8154 73.2948 356.0876 37.8742 89.6848 96.1192 136.0836 75.6386 215.6123 79.9938 129.1552 8.7021 73.1154 34.3348 45.4638 38.2589 403.5915 8.8324 2.0202 84.6242 41.6054 96.2684 79.8508
temp: 298.150 k
press: 1.00000 atm
elementType: 8 8 8 8 8 6 6 6 6 6 6 6 1 1 1 1 1 1
symmnumber: 1
zpe: 323255.8 jmol-1
zpe.correction: 0.123122 hartree
zpe.thermalcorrener: 0.134109 hartree
zpe.thermalcorrenthalpy: 0.135053 hartree
zpe.thermalcorrgfe: 0.086503 hartree
zpe.sumelectzpe: -645.584166 hartree
zpe.sumelectthermal: -645.573179 hartree
zpe.sumelectthermalent: -645.572235 hartree
zpe.sumelectthermalfe: -645.620785 hartree
dipole: -4.5644 -3.5885 0.0104
dipole: 5.8062
quadrupole: -55.9073 -62.9504 -70.9648
quadrupole: -2.5857 -0.0415 -0.0259
quadrupole: 7.3668 0.3238 -7.6906 -2.5857 -0.0415 -0.0259
hfenergy: -645.7072881 hartree
pointgroup: C01 [X(C7H6O5)]
dipole: -1.8397888 -1.3517196 -0.0784789 debye
dipolederiv: -0.130357 -0.2485609 -0.0008221 -0.1551365 -1.2584114 -0.0278594 0.0016179 -0.0302786 -0.3697805 -0.7326384 0.582119 0.0085915 0.6431631 -0.8033731 0.0050307 0.0102484 0.0036368 -0.4218461 -1.5501655 -0.2887503 -0.0350173 -0.155529 -0.1759789 0.0013528 -0.0332242 -0.0023621 -0.4327165 -0.7932437 0.4801947 0.0048774 0.6424717 -0.9180136 0.00278 0.0092057 -0.0010707 -0.44352 -0.9678454 -0.3088808 -0.0248366 -0.266119 -0.7626362 -0.0190692 -0.0238894 -0.0204033 -0.3201232 -0.9042402 0.0429199 -0.0202313 -0.195873 -0.2013128 -0.0092115 -0.0267428 -0.0032548 -0.0432443 0.3275032 0.5295184 0.0202393 -0.0222562 1.1212826 0.027223 0.0050332 0.0406532 0.0924537 0.2292017 -0.8790077 -0.0187389 -0.8540798 0.2968056 -0.0124442 -0.0173359 -0.0129169 -0.000857 0.305697 0.0335474 0.0110131 0.3308737 0.0100658 0.0113854 0.0192066 0.004161 -0.10522 1.3668761 0.2459522 0.0383036 0.2401641 0.2723633 0.0121661 0.0383069 0.0123 0.0654875 -0.5247693 0.0543882 -0.0060297 0.1852762 -0.0635321 0.0087675 -0.0026736 0.0054206 -0.2138425 2.1129745 -0.1155745 0.0437127 -0.1233866 1.3334484 0.0277309 0.043821 0.0279028 0.2380437 0.1053657 0.0544413 0.0001226 0.0526039 0.0452238 -0.0020138 0.000135 -0.0019521 0.163443 0.0135619 -0.0883118 -0.0065603 -0.082812 -0.052822 -0.0086046 -0.0064378 -0.0087125 0.1825224 0.1865001 0.0575053 -0.0033783 0.0583703 0.4429886 0.0028919 -0.0033964 0.002958 0.387977 0.3222033 -0.1368224 -0.0060444 -0.1592406 0.3252465 -0.0064849 -0.0065375 -0.0057949 0.4155031 0.4369597 0.070928 0.0023498 0.0400503 0.1162984 -0.0056344 0.0028577 -0.0046319 0.4092501 0.1964163 -0.0856061 -0.0075511 -0.1785404 0.2723572 -0.0080062 -0.0101948 -0.0056547 0.3964695 unknown
polarizability: 140.9656669|3.5578583|110.4868775|2.628721|2.0830211|37.9544103 unknown
InChI: InChI=1S/C7H6O5/c8-4-2-1-3(7(11)12)5(9)6(4)10/h1-2,8-11H
charge 0 multiplicity 1
18 atoms
O  0.457519 2.162044 0.09753
O  -2.202533 1.781081 0.023161
O  -3.33187 -0.71745 -0.0737
O  3.030169 -1.342455 0.065808
O  3.014121 0.976657 0.130466
C  0.890357 -0.265493 0.041829
C  0.004716 0.853485 0.050871
C  -1.394217 0.630483 0.010989
C  0.326895 -1.573681 -0.008127
C  -1.92445 -0.669832 -0.037875
C  -1.061043 -1.789572 -0.048253
C  2.359646 -0.089686 0.08379
H  1.014647 -2.421443 -0.014867
H  -1.464404 -2.807683 -0.08654
H  -0.331737 2.770774 0.094753
H  -3.158497 1.523128 -0.007042
H  -3.670236 -1.64409 -0.102238
H  4.006415 -1.156568 0.096045
