program: Gaussian 09
title: 000132997
version: EM64L-G09RevD.01
frameworkgroup: C1[X(C23H29FIN3O2)]
method: RPBEPBE
basis: SDD
operation: Freq
keyword: #p
keyword: freq=noraman
keyword: PBEPBE/SDD
title: #p freq=noraman PBEPBE/SDD
converged: NO YES NO NO
title: Mulliken charges:
elementType: I F O O N N N C C C C C C C C C C C C C C C C C C C C C C C H H H H H H H H H H H H H H H H H H H H H H H H H H H H H
charge: 0.050840 -0.210341 -0.288199 -0.269944 -0.054103 -0.445928 -0.691226 0.404972 -0.470017 -0.528515 -0.377759 -0.380384 -0.738835 -0.323794 -0.404362 0.156232 -0.562491 0.163419 0.512432 0.205968 -0.290690 -0.378403 -0.381936 -0.569282 -0.659402 0.740102 -0.367385 -0.366634 0.310034 -0.530201 0.205774 0.255781 0.205832 0.225914 0.217232 0.188908 0.164143 0.219541 0.210176 0.261032 0.203638 0.202437 0.176195 0.315072 0.221193 0.224387 0.207579 0.204661 0.255300 0.238059 0.239608 0.249877 0.252258 0.252785 0.313772 0.315217 0.281785 0.226976 0.210702
chargesum: 0.00000
title: Mulliken charges with hydrogens summed into heavy atoms:
elementType: I F O O N N N C C C C C C C C C C C C C C C C C C C C C C C
charge: 0.050840 -0.210341 -0.288199 -0.269944 -0.054103 -0.130856 -0.062238 0.404972 -0.008462 -0.096769 0.028380 0.003300 -0.063989 0.054838 0.041218 0.156232 -0.150251 0.163419 0.512432 0.205968 -0.035389 -0.140344 -0.142328 -0.319405 -0.659402 0.740102 -0.115127 -0.113849 0.310034 0.189263
polarizability: 3.60374596e+02 2.41154050e+00 3.41906041e+02 2.19203931e+01 -1.51676735e+00 2.26480624e+02
1716.lowfreq: -8.4779 -7.8072 -5.0259 0.0005 0.0007 0.0008 3.0175 5.8899 9.4578
frequency: -7.5946 5.4631 8.9965 18.8333 29.7260 40.4053 46.7542 69.0133 76.2575 85.7799 99.6219 108.1454 120.8760 142.8572 152.1938 173.2791 182.4027 196.1044 204.3297 212.6811 220.8329 229.5070 236.9965 256.9361 267.3006 274.9852 280.7538 297.8385 301.0525 330.1971 350.7215 357.3643 367.4248 398.5348 400.1812 411.4707 413.0160 428.1079 430.8359 437.1631 456.3656 468.3636 478.0862 492.0416 512.6325 521.3225 544.0643 550.3576 600.1594 606.1627 624.1659 629.9860 673.6688 704.0502 710.5027 716.0516 733.7106 741.7288 752.9845 759.0097 775.4229 803.3967 817.6926 821.8056 836.8370 839.9214 853.8641 861.5710 883.7135 899.7690 915.7653 921.1175 940.6389 957.6967 977.0860 995.9972 1005.8818 1006.3274 1011.7318 1020.5523 1025.3099 1039.0690 1043.8516 1053.8582 1069.4074 1104.3326 1109.2991 1116.7321 1119.9842 1128.8225 1145.6033 1152.5088 1154.9762 1163.1220 1175.1912 1188.8237 1195.1758 1196.6943 1212.7718 1216.4985 1241.3880 1255.3844 1262.6060 1269.6737 1279.2953 1281.4329 1291.5052 1297.1661 1300.5624 1304.0061 1327.9526 1334.8377 1342.7753 1353.7745 1371.6700 1375.5156 1380.4306 1383.3889 1398.2635 1406.6142 1408.9542 1441.4842 1448.2921 1450.1340 1453.4961 1460.5105 1462.1654 1469.9651 1472.1746 1474.2350 1476.6847 1482.4504 1486.8965 1491.0004 1493.6511 1495.3243 1532.5193 1584.2188 1602.7167 1612.4709 1615.4359 1639.1659 2793.1732 2814.2869 2836.2883 2975.1319 2975.5989 2979.2039 2982.3105 2992.3778 2999.5090 3008.0076 3019.5968 3024.7290 3052.1981 3057.2685 3063.1490 3074.1526 3079.9735 3085.8203 3100.5555 3123.8528 3129.4262 3132.1434 3140.7579 3152.9741 3171.6596 3174.3968 3528.1342 3540.0642 3689.4780
redmass: 3.7377 9.6856 7.8094 5.3564 6.4546 5.5149 4.5176 3.4665 3.7606 5.2647 4.7163 2.3531 6.0708 4.1506 4.0096 4.0419 4.3001 1.8366 4.6729 1.5273 2.1859 2.5591 5.1787 2.8923 2.6895 3.1913 2.5862 3.2329 3.9732 3.1561 4.2255 2.8732 2.6440 3.7620 2.7357 2.9607 1.2203 1.9654 3.7176 2.0062 2.0124 3.4364 3.6035 3.3082 4.4451 4.2638 2.7944 1.1868 4.3450 5.2735 2.5637 6.8876 8.9076 5.8245 3.9241 3.5579 4.1488 3.9436 4.1008 1.1104 3.5051 1.5900 1.2480 2.7337 4.5741 2.2998 1.3669 1.9557 1.5091 2.0278 5.1142 2.5565 1.3658 1.3571 2.0549 1.6754 1.7264 2.7846 3.1670 2.2597 3.1390 2.1130 1.6828 1.5941 2.4899 2.1609 1.6906 1.5435 1.6456 2.2597 2.4310 1.4659 1.4828 1.6238 2.1839 1.1787 1.8057 2.5220 2.0799 3.2178 1.5822 1.6138 1.3917 1.4682 1.5777 1.3903 2.3350 1.3168 1.3825 1.5508 1.4013 1.4412 1.3271 1.5182 1.3812 3.3437 1.2763 6.6840 1.4382 2.8800 4.2199 1.3572 1.2499 1.3206 1.0723 1.0837 1.0928 1.0937 1.0905 1.1752 1.1204 1.1658 1.0955 1.1029 3.3970 2.6599 6.4820 5.5777 7.5285 6.5096 2.8119 1.6072 1.0711 1.0714 1.0699 1.0339 1.0591 1.0477 1.0519 1.0701 1.0752 1.0624 1.0857 1.1010 1.0884 1.0980 1.1026 1.0991 1.1005 1.0980 1.0995 1.1054 1.0901 1.0898 1.0915 1.0912 1.0951 1.0959 1.0771 1.0466 1.1026
irintensity: 0.0131 0.0151 0.2269 0.7787 0.1987 1.3555 0.1374 0.4916 1.5912 1.7691 5.7213 0.3788 3.8204 1.2268 0.8926 0.3995 3.6471 1.0320 2.7338 0.5602 0.6557 0.1328 1.1695 3.9654 3.3051 10.0873 0.5124 0.0186 12.9652 4.3045 1.1920 6.3584 1.4496 2.7110 10.1111 0.0376 15.2192 117.5630 10.1736 97.2115 41.0977 9.9663 2.0040 1.7466 9.0498 2.5208 24.9165 117.4383 8.0417 21.2167 7.0947 0.0373 8.6680 10.1017 5.6609 1.5424 9.5710 9.4605 11.3151 3.6859 1.9321 1.1922 0.1645 34.4966 11.9719 52.1450 0.7069 42.7522 17.6175 3.9668 13.3993 7.3839 0.2708 0.0369 22.4320 1.9768 2.8120 7.5603 12.1088 6.7961 5.7014 4.7874 0.7600 2.0031 2.1114 65.7593 19.4137 21.0949 2.8920 2.8838 24.4937 15.6366 37.9867 1.8610 43.8445 8.5694 43.3408 197.7325 48.6631 6.3719 58.1322 36.9590 33.0486 40.5320 60.9012 15.5058 78.0664 9.0239 19.5659 9.7762 7.8493 1.3643 28.4886 33.9939 4.6641 55.8945 38.5667 0.2167 5.9959 0.7473 5.8098 219.6662 58.5701 42.2869 22.7523 3.7526 32.7744 11.3553 3.8917 81.9317 45.2752 42.2128 46.7652 13.6069 42.1605 121.5696 67.0611 136.7517 4.4891 8.2520 77.5251 434.2545 90.1394 68.0113 220.9530 52.0498 21.6154 10.0648 69.6737 11.4076 39.3300 24.5948 59.1036 1.7184 45.7123 26.0805 44.6871 43.8792 23.0763 39.5125 13.1789 18.8480 12.7031 13.3127 1.1818 6.0539 5.9447 2.6377 17.9897 83.5203 41.8637
temp: 298.150 k
press: 1.00000 atm
elementType: 53 9 8 8 7 7 7 6 6 6 6 6 6 6 6 6 6 6 6 6 6 6 6 6 6 6 6 6 6 6 1 1 1 1 1 1 1 1 1 1 1 1 1 1 1 1 1 1 1 1 1 1 1 1 1 1 1 1 1
symmnumber: 1
zpe: 1261507.5 jmol-1
zpe.correction: 0.480483 hartree
zpe.thermalcorrener: 0.510096 hartree
zpe.thermalcorrenthalpy: 0.511040 hartree
zpe.thermalcorrgfe: 0.415419 hartree
zpe.sumelectzpe: -1317.656194 hartree
zpe.sumelectthermal: -1317.626581 hartree
zpe.sumelectthermalent: -1317.625637 hartree
zpe.sumelectthermalfe: -1317.721258 hartree
dipole: -3.3790 -0.8365 4.2627
dipole: 5.5035
quadrupole: -207.3249 -181.1982 -197.2679
quadrupole: 12.2012 9.6408 12.6673
quadrupole: -12.0612 14.0655 -2.0043 12.2012 9.6408 12.6673
hfenergy: -1318.1366773 hartree
pointgroup: C01 [X(C23H29F1I1N3O2)]
dipole: -1.3021066 -0.0074087 1.7299304 debye
polarizability: 360.2780391|8.1064458|336.1086894|20.0102225|-25.8922386|232.3745327 unknown
InChI: InChI=1S/C23H29FIN3O2/c1-23(27-22(29)18-14-19(25)20(26)15-21(18)30-2)9-12-28(13-10-23)11-3-4-16-5-7-17(24)8-6-16/h5-8,14-15,27H,3-4,9-13,26H2,1-2H3
charge 0 multiplicity 1
59 atoms
I  -2.611359 -3.817202 1.724361
F  9.107761 -1.317265 -1.664248
O  -3.087204 1.572724 -1.93455
O  -6.130994 0.392024 -1.518752
N  1.115917 1.491331 1.061216
N  -2.438808 1.691352 0.30858
N  -5.655154 -3.963511 0.35355
C  -1.438523 2.796438 0.193373
C  -0.299963 2.401502 -0.791259
C  -0.807174 2.992508 1.598464
C  0.539337 1.216336 -0.281565
C  0.050558 1.792411 2.046619
C  -2.142174 4.094847 -0.271105
C  2.001816 0.404117 1.545463
C  3.310714 0.263865 0.742015
C  -3.144675 1.123743 -0.741408
C  4.261445 -0.787631 1.379309
C  -3.929285 -0.107115 -0.364591
C  5.554583 -0.952042 0.594698
C  -5.243979 -0.435563 -0.829484
C  -3.236691 -1.111185 0.372809
C  6.675692 -0.123826 0.862811
C  5.656768 -1.906456 -0.450985
C  -5.787648 -1.714781 -0.578068
C  -3.783848 -2.374476 0.623142
C  -5.084378 -2.719517 0.136706
C  7.868983 -0.235008 0.114881
C  6.838371 -2.037851 -1.214587
C  7.919484 -1.193716 -0.910924
C  -5.973866 1.854431 -1.538654
H  0.359797 3.281618 -0.909919
H  -0.734151 2.160684 -1.776746
H  -1.599058 3.191209 2.349277
H  -0.161089 3.887858 1.553357
H  1.362951 1.032426 -0.992392
H  -0.090013 0.286901 -0.261559
H  -0.604047 0.893796 2.2244
H  0.52768 2.027803 3.016613
H  -1.410234 4.919435 -0.349534
H  -2.608346 3.941289 -1.258411
H  -2.925604 4.393345 0.450153
H  2.261254 0.632766 2.598693
H  1.466327 -0.584435 1.553978
H  -2.633876 1.333283 1.246164
H  3.103309 -0.036922 -0.302364
H  3.812327 1.249202 0.699173
H  3.729638 -1.757649 1.441343
H  4.486674 -0.479998 2.419659
H  -2.214593 -0.900839 0.703364
H  6.618002 0.616536 1.669488
H  4.804042 -2.559856 -0.670527
H  -6.802889 -1.909982 -0.938646
H  8.738713 0.39678 0.317612
H  6.926523 -2.773172 -2.019734
H  -6.572439 -4.182535 -0.023481
H  -5.154861 -4.679075 0.876907
H  -5.208499 2.150959 -2.272835
H  -6.967981 2.235099 -1.819734
H  -5.694462 2.236792 -0.537817
