program: Gaussian 09
title: 000132931
version: EM64L-G09RevD.01
frameworkgroup: C1[X(C9H8N2O4)]
method: RPBEPBE
basis: SDD
operation: Freq
keyword: #pfreq=noraman
keyword: PBEPBE/SDD
title: #p freq=noraman PBEPBE/SDD
converged: NO YES NO NO
title: Mulliken charges:
elementType: O O O O N N C C C C C C C C C H H H H H H H H
charge: -0.242853 -0.216809 -0.205563 -0.211955 -0.164998 0.017215 -0.439404 0.392728 0.129016 -0.512194 0.210561 -0.312518 0.402269 -0.598511 -0.359273 0.243072 0.255398 0.291822 0.276392 0.233737 0.236215 0.281011 0.294642
chargesum: 0.00000
title: Mulliken charges with hydrogens summed into heavy atoms:
elementType: O O O O N N C C C C C C C C C
charge: -0.242853 -0.216809 -0.205563 -0.211955 -0.164998 0.017215 0.059066 0.392728 0.129016 -0.220373 0.210561 -0.036126 0.402269 0.152452 -0.064631
polarizability: 2.07539013e+02 -4.06870675e+00 1.33885682e+02 1.51791275e+00 2.01072532e+00 5.72420112e+01
1716.lowfreq: -8.2208 -1.0499 0.0003 0.0004 0.0008 7.5240 26.5417 57.8682 81.1453
frequency: 26.5254 57.8593 81.1323 129.4555 140.3876 155.0286 192.6028 230.2025 285.0311 297.4572 317.7182 350.2685 407.6360 437.5996 484.1846 522.8281 525.9423 563.7994 622.4027 668.7076 678.3253 686.8656 715.8779 734.5636 762.8250 844.5663 850.5289 907.9251 926.4584 965.4255 988.2014 1007.0844 1062.0979 1081.6943 1121.6365 1126.7877 1184.1652 1190.0525 1217.1003 1234.2418 1248.1913 1252.2929 1289.7054 1364.8054 1400.0841 1417.3091 1426.3577 1443.1074 1470.9796 1478.0576 1483.2556 1499.9747 1597.1955 1623.6109 1707.8107 2929.7015 2976.8442 3007.7175 3057.3060 3134.1162 3163.7183 3174.5322 3193.5315
redmass: 3.8940 10.3801 5.8760 1.1560 7.0552 6.8989 2.6965 3.5284 5.3411 7.9018 6.7853 4.7765 5.8466 3.0836 8.4394 7.3053 4.4018 6.0299 7.8473 8.3484 7.4212 6.4319 7.2151 4.5196 6.8642 4.8008 1.5467 4.5387 1.4426 5.2921 1.3523 1.7061 2.0303 2.0555 1.4772 1.2940 3.0152 2.7951 6.4252 1.6134 1.7261 2.0007 2.3458 10.3442 2.3866 5.4672 1.2619 2.9621 1.2058 1.9724 1.0760 1.2773 7.8019 7.9919 9.8618 1.0681 1.0371 1.0926 1.1016 1.0978 1.0925 1.0895 1.0973
irintensity: 1.6878 2.6092 5.4153 0.5167 1.2771 2.8617 5.2403 2.4608 1.9291 0.4597 1.3688 11.6958 19.4600 6.6419 1.5860 4.0301 1.3237 3.6799 8.2552 11.8465 22.5302 5.7508 8.1984 7.6277 28.7577 34.9857 38.5710 6.6905 21.3799 275.7400 1.6388 6.1205 184.4859 17.6079 37.6556 0.4715 499.6368 40.7053 115.6508 116.2764 6.3948 107.1481 14.0697 78.6213 65.3962 19.4660 45.8044 63.1243 43.3620 59.5625 19.5649 9.2391 78.4804 64.9432 436.3458 34.1555 52.0138 17.4514 29.1228 1.1449 2.0748 0.3621 2.3430
temp: 298.150 k
press: 1.00000 atm
elementType: 8 8 8 8 7 7 6 6 6 6 6 6 6 6 6 1 1 1 1 1 1 1 1
symmnumber: 1
zpe: 431393.7 jmol-1
zpe.correction: 0.164309 hartree
zpe.thermalcorrener: 0.177137 hartree
zpe.thermalcorrenthalpy: 0.178081 hartree
zpe.thermalcorrgfe: 0.123745 hartree
zpe.sumelectzpe: -757.000130 hartree
zpe.sumelectthermal: -756.987302 hartree
zpe.sumelectthermalent: -756.986358 hartree
zpe.sumelectthermalfe: -757.040694 hartree
dipole: 2.8752 2.9813 0.4038
dipole: 4.1615
quadrupole: -118.6740 -81.5469 -85.1976
quadrupole: 22.0793 -0.0789 0.3724
quadrupole: -23.5345 13.5926 9.9419 22.0793 -0.0789 0.3724
hfenergy: -757.164439 hartree
pointgroup: C01 [X(C9H8N2O4)]
dipole: -1.1069955 1.1947815 -0.1663235 debye
dipolederiv: -2.4051921 0.1136271 0.0539289 0.3501567 -0.4410618 -0.0151946 0.0683722 -0.0543445 -0.2084861 -1.3760321 -0.3900538 0.0524634 -0.1946594 -0.6779488 0.0233487 0.0925437 0.0556857 -0.3543847 -0.9618672 0.1672011 -0.0324726 0.2431134 -0.5369622 0.0201705 -0.0429418 0.0203729 -0.2309653 -0.6514208 -0.1584218 -0.0084423 -0.3332814 -0.788104 0.0116533 -0.0075676 0.0136965 -0.2330139 -0.6624513 -0.0614087 0.0376817 0.1733186 -1.0566938 0.0450759 0.0256559 -0.0693546 -0.3221977 2.0570438 0.1645048 0.0611816 0.3236919 1.1169502 -0.0247324 0.0735458 -0.0307366 0.1913366 0.3645448 0.1789266 -0.0680086 0.1927237 0.1965158 -0.074419 -0.0584464 0.0002615 0.3875511 -0.2957953 -0.1609336 0.0325751 -0.6479195 -0.090663 -0.0097725 0.0527614 -0.0328923 -0.062462 1.6229321 0.1141025 0.0208317 0.5894534 0.168759 -0.0149852 0.0403132 0.0106626 0.1179442 0.3602665 0.1231577 0.0139635 -0.0834584 -0.0335558 -0.0150409 0.0195589 0.0031243 -0.1002828 2.533233 0.3089438 -0.1166931 -0.6234149 1.6071916 0.0036192 -0.1955448 -0.0095057 0.3252033 -0.6281215 0.0029794 0.0036218 0.2148725 0.113413 -0.0015964 -0.0149783 -0.002196 -0.1377231 -0.9170925 -0.165413 -0.0243674 -0.2668684 -0.0920067 0.0026677 -0.0334153 0.001469 0.0499646 0.2601719 -0.2824918 0.0251173 -0.2717347 0.3237664 0.0205043 0.0166803 0.0529239 0.259779 0.2616951 0.0366483 0.0075684 0.3310742 0.0645358 0.0001925 0.0025299 -0.0065052 -0.1072196 0.0245856 -0.0285863 0.0063508 -0.0187363 -0.0556867 -0.0634669 0.0065387 -0.1091768 0.0119931 -0.0412291 0.0148942 -0.0284183 -0.0037653 0.0065154 0.0730795 0.0065057 0.1276797 -0.0980652 0.1341559 -0.0129115 0.000814 0.0081392 0.0343353 0.0062702 0.0043078 0.0016257 0.162364 0.0835179 -0.0405106 -0.0025077 -0.0308744 0.0081665 0.0067408 0.0024098 0.0061629 0.1685095 0.0764261 0.0385009 0.0311415 0.1008363 -0.028426 0.0756135 -0.0516604 0.1279723 -0.0882728 0.0689977 -0.0288035 -0.0855378 0.0623359 -0.0385649 -0.102701 -0.0208799 -0.1205353 -0.0338797 0.0150408 0.0028815 0.0253044 -0.132968 0.102764 0.0284186 0.02055 0.0092326 0.1293779 0.0765906 0.0631667 -0.0060961 0.0179648 0.0967607 0.0045543 -0.0068387 0.0043772 0.1729295 unknown
polarizability: 207.6826164|2.5403845|133.7079645|1.0786951|-2.7009854|57.2761249 unknown
InChI: InChI=1S/C9H8N2O4/c1-10-5-6-4-7(11(13)14)2-3-8(6)15-9(10)12/h2-4H,5H2,1H3
charge 0 multiplicity 1
23 atoms
O  -1.818826 -1.374864 -0.134477
O  -4.0723 -1.012308 0.158768
O  4.476243 -0.511389 0.129283
O  3.783971 1.660518 0.016937
N  -2.667959 0.863568 0.052898
N  3.553097 0.388514 0.052582
C  -1.359444 1.473261 -0.276375
C  -0.217329 0.491726 -0.130939
C  -0.502652 -0.894082 -0.080379
C  1.124849 0.907395 -0.080951
C  -2.95175 -0.485889 0.030094
C  0.522642 -1.863891 0.007239
C  2.146471 -0.062519 0.005351
C  -3.787494 1.810845 0.217432
C  1.862562 -1.448342 0.047909
H  -1.20641 2.337528 0.398432
H  -1.390788 1.877195 -1.312676
H  1.399843 1.966208 -0.112841
H  0.246162 -2.920919 0.043194
H  -3.934393 2.404527 -0.705327
H  -3.580385 2.498007 1.058173
H  -4.705372 1.243301 0.426552
H  2.685064 -2.16439 0.11552
