program: Gaussian 09
title: 000133026
version: EM64L-G09RevD.01
frameworkgroup: C1[X(C27H22O10)]
method: RPBEPBE
basis: SDD
operation: Freq
keyword: #p
keyword: freq=noraman
keyword: PBEPBE/SDD
title: #p freq=noraman PBEPBE/SDD
converged: YES YES NO NO
title: Mulliken charges:
elementType: O O O O O O O O O O C C C C C C C C C C C C C C C C C C C C C C C C C C C H H H H H H H H H H H H H H H H H H H H H H
charge: -0.438911 -0.268599 -0.379838 -0.526856 -0.330751 -0.150981 -0.442916 -0.429813 -0.393461 -0.347131 -0.366909 0.302877 -0.712286 0.200182 0.474345 0.090475 -0.141176 -0.141228 0.290794 0.126928 -0.760853 0.089223 0.538100 -0.082696 -0.615371 0.026736 -0.241967 0.017855 0.321303 -0.045160 0.158564 0.135627 -0.422125 -0.691399 -0.512206 -0.360640 -0.188371 0.288369 0.252667 0.251498 0.254056 0.236044 0.238457 0.341568 0.217955 0.417014 0.413607 0.289352 0.219573 0.239699 0.221091 0.254468 0.228598 0.232340 0.260281 0.237036 0.337141 0.400678 0.387142
chargesum: 0.00000
title: Mulliken charges with hydrogens summed into heavy atoms:
elementType: O O O O O O O O O O C C C C C C C C C C C C C C C C C C C C C C C C C C C
charge: -0.097343 -0.268599 0.037176 -0.113249 -0.330751 -0.150981 -0.105775 -0.029136 -0.006319 -0.347131 -0.078540 0.302877 -0.208121 0.200182 0.474345 0.090475 -0.141176 -0.141228 0.290794 0.126928 -0.506797 0.089223 0.538100 -0.082696 -0.140869 0.026736 -0.241967 0.017855 0.321303 0.172794 0.158564 0.135627 -0.132773 -0.011035 0.203199 -0.100358 0.048666
polarizability: 6.54698696e+02 -2.11309325e+01 3.78208633e+02 2.46423984e+01 7.69077959e+00 1.85390398e+02
1716.lowfreq: -4.3650 -1.6761 -0.0008 0.0002 0.0007 5.2977 16.1285 23.3424 34.0108
frequency: 16.1123 23.2178 33.9876 36.1364 39.9399 49.5574 61.1289 69.1145 76.6653 106.0147 107.2659 114.7955 123.8580 133.1810 146.2242 161.9984 173.6060 187.4422 200.9758 211.8344 216.7197 224.1947 237.4392 246.2170 258.4813 272.7026 276.5688 283.5433 290.7468 318.6882 320.9035 335.7169 348.9944 349.1108 359.2103 385.6675 395.7948 397.2381 411.5176 418.8168 430.9364 446.8149 454.2371 456.1695 465.4716 480.0203 489.3933 497.5302 525.3391 529.8590 539.4122 560.3930 563.9042 577.4230 590.7674 600.3582 603.1212 625.9579 649.1643 661.4691 681.7358 685.7031 695.8478 712.1797 716.7931 746.2491 759.8403 763.4672 765.9035 778.7042 811.4060 814.4818 831.5349 836.6262 848.3523 850.3389 880.9099 887.8123 895.4946 902.7486 909.1580 922.9817 959.2542 964.7028 975.7789 982.6139 984.2816 992.7583 1010.2193 1023.3490 1039.6114 1052.9727 1054.5655 1062.4693 1074.4414 1092.7021 1106.9856 1110.6661 1116.5490 1153.0398 1162.0771 1167.3455 1174.3861 1190.0212 1199.9066 1215.2491 1236.4583 1240.1169 1242.3142 1258.4658 1268.1182 1274.8204 1283.3704 1294.4481 1296.7951 1313.6989 1319.4291 1331.3302 1337.4699 1359.3175 1364.5375 1375.2131 1377.9982 1386.6690 1398.4296 1401.3301 1413.9930 1421.1275 1422.3379 1431.9013 1437.2951 1443.6782 1445.3619 1448.4347 1456.9717 1462.6260 1464.1130 1465.9660 1476.3644 1478.8782 1517.9367 1532.1719 1543.3692 1552.5172 1576.3251 1581.7942 1591.7021 1628.4076 1636.8135 2595.1141 2712.7021 2967.8626 2977.8210 2980.6682 2993.8953 3014.9332 3023.9750 3029.4803 3041.8319 3081.5016 3092.1751 3094.1681 3102.2269 3126.4958 3133.5762 3142.8766 3169.6991 3179.0589 3494.3879 3541.2940 3555.7228
redmass: 6.7163 5.5112 6.0732 4.0246 5.5527 6.9139 5.3415 5.5036 5.9188 6.9481 4.4827 4.3875 2.8874 1.4327 5.5552 6.6897 6.9548 5.7906 5.0651 1.2827 4.6973 3.3406 4.1630 1.8741 3.4472 3.8023 4.9421 4.2789 6.6184 6.7303 5.2450 5.2095 1.5225 2.4663 5.2915 5.0018 6.5770 2.6996 7.5579 6.8480 5.8250 8.6780 2.9061 5.1902 5.4623 5.5202 6.4858 7.2660 6.8424 5.9280 5.4059 5.1343 3.3652 5.8184 5.5983 3.6864 2.4586 3.0786 5.4256 5.8114 5.7607 5.4777 4.1723 6.6375 6.0775 4.2560 6.7567 7.5119 3.5367 4.5727 1.3956 2.6457 3.7174 2.6853 6.4218 3.3003 2.9871 2.4867 4.3377 1.7886 2.0339 1.4571 1.0898 4.1456 5.0894 1.1439 4.1854 1.3604 5.4305 3.9850 3.0664 2.5978 2.7035 2.2728 1.9899 2.7620 1.2694 1.8597 2.9496 1.4655 2.3878 1.1488 1.2040 1.2866 1.2908 1.8983 2.3074 1.8058 1.4245 2.0871 2.4972 3.3444 1.2752 3.7786 2.8660 2.6449 3.1820 1.2333 4.7692 3.7797 2.2751 1.7876 1.6754 3.7259 3.1190 1.7705 2.6308 4.8042 2.1689 2.3057 2.0927 1.1787 2.2197 3.3326 1.1209 1.5104 1.7421 1.1340 1.0577 1.0563 5.6334 7.6015 4.3944 5.3455 7.5138 4.6398 4.9999 5.5745 2.6229 1.0801 1.0706 1.0642 1.0842 1.0313 1.0359 1.0612 1.0677 1.0858 1.0956 1.1012 1.1024 1.0997 1.0999 1.1036 1.0914 1.0880 1.0923 1.0981 1.0635 1.0662 1.0659
irintensity: 0.0380 0.4528 3.1943 1.8837 1.3866 1.2844 1.0111 0.4203 0.2627 0.9662 1.6412 0.5814 3.7041 1.1736 1.9207 6.3573 6.5056 2.9142 2.7933 0.1172 10.7742 16.3603 3.0238 80.0463 7.5609 27.5206 2.7620 1.8722 10.1896 4.0672 5.9329 31.1113 44.7462 65.3070 8.4843 9.7460 5.5344 4.6018 1.3373 17.7176 10.5328 3.0164 30.7620 9.6971 3.4376 4.1625 2.2189 2.7593 2.9214 7.3109 3.2917 7.3103 16.3819 0.6877 58.3115 19.0680 62.4622 32.9042 8.0879 15.5450 4.7063 48.1681 5.9612 2.2754 13.6702 2.4204 2.8008 9.6642 35.2354 23.5838 127.5436 89.5937 4.5209 7.2177 9.5868 24.6407 24.4564 23.9020 23.9694 15.4790 68.7764 1.3790 107.5057 26.7385 35.8027 123.4265 20.0513 3.7888 84.8369 75.4204 129.8940 148.8752 4.8136 29.7029 18.2169 26.7731 12.8564 43.9697 244.3935 70.2422 143.8614 28.5990 51.4727 198.9283 35.8488 20.1161 32.9287 12.7704 76.2926 373.7088 83.0393 150.2520 103.3945 339.2062 47.4225 9.7333 36.3701 21.2396 16.1273 56.9779 43.9378 50.1073 40.4381 55.8661 117.4199 69.1367 15.5051 99.1641 141.0446 112.3200 34.7968 104.2619 60.8945 395.4796 14.2422 20.8766 23.8401 17.1652 22.2101 8.6641 19.4688 146.7905 28.0349 81.5814 48.7936 94.5656 89.1781 49.8584 213.1635 943.2216 228.8886 7.9103 22.8834 68.3038 12.4328 47.8789 828.6211 12.3045 30.6977 8.5178 18.7464 31.2925 35.4809 20.3805 14.2683 13.7213 0.6551 19.3220 103.4480 4.8654 15.1686
temp: 298.150 k
press: 1.00000 atm
elementType: 8 8 8 8 8 8 8 8 8 8 6 6 6 6 6 6 6 6 6 6 6 6 6 6 6 6 6 6 6 6 6 6 6 6 6 6 6 1 1 1 1 1 1 1 1 1 1 1 1 1 1 1 1 1 1 1 1 1 1
symmnumber: 1
zpe: 1145874.0 jmol-1
zpe.correction: 0.436440 hartree
zpe.thermalcorrener: 0.468875 hartree
zpe.thermalcorrenthalpy: 0.469819 hartree
zpe.thermalcorrgfe: 0.372133 hartree
zpe.sumelectzpe: -1791.712867 hartree
zpe.sumelectthermal: -1791.680433 hartree
zpe.sumelectthermalent: -1791.679489 hartree
zpe.sumelectthermalfe: -1791.777174 hartree
dipole: -7.1756 2.4652 -1.0451
dipole: 7.6589
quadrupole: -207.0915 -198.3463 -215.7048
quadrupole: -0.9615 12.5687 -2.8622
quadrupole: -0.0440 8.7012 -8.6572 -0.9615 12.5687 -2.8622
hfenergy: -1792.1493075 hartree
pointgroup: C01 [X(C27H22O10)]
dipole: 2.833887 0.9075355 0.4745171 debye
polarizability: 654.7494962|15.6753672|377.9266138|29.9516325|-0.7513158|185.621617 unknown
InChI: InChI=1S/C27H22O10/c1-9(28)6-10-7-11-8-14(30)18-19(15(11)23(32)16(10)27(35)36)25(34)20-21(26(18)37-2)24(33)17-12(22(20)31)4-3-5-13(17)29/h3-5,7,9,14,28-30,32,34-35H,6,8H2,1-2H3
charge 0 multiplicity 1
59 atoms
O  0.922997 3.142734 1.678586
O  -2.174839 3.154511 0.289428
O  -0.112971 -1.991722 -0.431751
O  1.864538 -1.924887 1.102945
O  -4.645831 2.020124 0.164176
O  -2.49058 -2.986372 0.287117
O  8.29972 -0.220513 -1.069857
O  6.014436 -2.121355 1.178368
O  -6.896696 1.111083 -0.497825
O  3.976972 -3.030871 1.65663
C  0.550349 2.899652 0.262469
C  -0.314255 1.654403 0.231271
C  1.781565 2.692701 -0.636047
C  0.288207 0.368364 0.125785
C  2.529729 1.442755 -0.24101
C  1.78194 0.290298 0.149063
C  -1.72347 1.825936 0.245671
C  -0.591383 -0.760644 -0.060656
C  -2.5966 0.701458 0.121794
C  -2.011035 -0.605485 0.000665
C  3.939211 1.443982 -0.229614
C  2.547954 -0.81813 0.61684
C  4.710602 0.337845 0.175791
C  3.999199 -0.824988 0.63294
C  6.220686 0.45668 0.093573
C  -4.068814 0.863711 0.01161
C  -2.894976 -1.823071 -0.017506
C  -4.895146 -0.298818 -0.322537
C  -4.339561 -1.610632 -0.354165
C  6.828751 -0.235709 -1.170991
C  4.631867 -2.032976 1.174913
C  -6.302833 -0.124212 -0.571007
C  -5.151899 -2.721671 -0.649773
C  6.498461 0.485381 -2.479764
C  -2.68355 3.634554 1.594841
C  -7.105996 -1.249856 -0.893699
C  -6.528961 -2.531628 -0.932835
H  -0.050563 3.748318 -0.111959
H  2.448928 3.573155 -0.599203
H  1.420724 2.606366 -1.682687
H  4.461475 2.353437 -0.54642
H  6.504492 1.523896 0.053437
H  6.697131 0.011601 0.982628
H  1.34349 4.039185 1.742617
H  6.467086 -1.284068 -1.210292
H  0.710466 -2.225346 0.120446
H  2.556879 -2.616333 1.47557
H  -4.698123 -3.716517 -0.647931
H  6.894822 1.516418 -2.455655
H  6.967118 -0.041938 -3.327683
H  5.408096 0.524051 -2.646485
H  -3.586586 3.073395 1.885003
H  -2.944913 4.69042 1.428128
H  -1.885096 3.545814 2.355478
H  -8.169196 -1.088478 -1.092866
H  -7.156864 -3.395018 -1.178032
H  8.570529 -0.751586 -0.277893
H  6.260849 -2.996392 1.58802
H  -6.149034 1.776289 -0.213659
