program: Gaussian 09
title: 000132892
version: EM64L-G09RevD.01
frameworkgroup: C1[X(C10H10IN5O)]
method: RPBEPBE
basis: SDD
operation: Freq
keyword: #p
keyword: freq=noraman
keyword: PBEPBE/SDD
title: #p freq=noraman PBEPBE/SDD
converged: YES YES NO NO
title: Mulliken charges:
elementType: I O N N N N N C C C C C C C C C C H H H H H H H H H H
charge: 0.036691 -0.233197 -0.428695 -0.069064 0.041802 0.054416 -0.016049 -0.361974 0.323398 -0.487392 -0.363750 0.352225 -0.294688 -0.391732 -0.239100 -0.193931 -0.250305 0.231740 0.231680 0.237122 0.243129 0.328608 0.291089 0.259849 0.231745 0.233755 0.232628
chargesum: 0.00000
title: Mulliken charges with hydrogens summed into heavy atoms:
elementType: I O N N N N N C C C C C C C C C C
charge: 0.036691 -0.233197 -0.100087 -0.069064 0.041802 0.054416 -0.016049 0.101446 0.323398 -0.007141 -0.363750 0.352225 -0.003598 -0.131883 -0.007355 0.039824 -0.017678
polarizability: 2.05838036e+02 9.28841899e+00 1.76787425e+02 1.36936687e+01 3.53074271e+00 1.50631395e+02
1716.lowfreq: -0.0007 -0.0006 -0.0005 0.8323 4.5982 9.0520 23.9867 41.6283 50.6062
frequency: 23.8536 41.5702 50.6023 55.8803 67.5275 69.8917 101.3008 109.2601 152.0577 164.7600 221.4606 229.0172 271.9230 292.0987 328.0422 381.2644 409.2132 419.4643 475.9111 493.0987 501.4045 530.7932 598.3970 607.4360 684.4435 691.4174 727.1586 742.0595 757.7702 796.6732 821.2646 834.7185 860.6128 907.4613 913.8590 924.4513 950.4793 970.3511 985.9013 989.9148 1018.1696 1024.0599 1070.7814 1075.2264 1084.9394 1144.7075 1169.5574 1170.5104 1191.6002 1213.1936 1250.1278 1279.5427 1282.4222 1320.0572 1323.3383 1384.2876 1443.0105 1458.6312 1460.9516 1473.1311 1507.1554 1562.7637 1593.7627 1606.8410 2054.5737 2982.9829 3011.2702 3035.0833 3068.7778 3133.9283 3143.4072 3159.8414 3168.6756 3176.1654 3611.9861
redmass: 5.6364 2.2704 7.2660 4.2610 6.4040 10.0112 3.8579 8.2837 10.9112 5.6348 6.0320 5.4835 10.4914 5.3101 7.6848 1.1404 2.9411 9.0135 11.3262 3.8630 6.3396 9.5836 6.6802 6.6120 9.2816 2.4476 5.6276 7.2840 1.4806 8.5460 1.2801 1.2560 7.5081 1.4405 6.3690 4.3346 6.9408 1.3701 6.2046 1.3043 3.7422 2.3262 3.5456 1.8029 1.5605 3.3690 1.1281 1.0856 1.1407 1.0855 1.4581 2.4925 2.1899 1.3702 1.8129 8.7940 2.2785 2.1132 1.1735 2.1216 1.1995 6.9262 6.1312 6.5807 13.9927 1.0588 1.0630 1.1045 1.1059 1.0852 1.0896 1.0934 1.0959 1.1009 1.0805
irintensity: 0.3308 5.4431 0.4960 0.1174 0.4079 0.6101 0.8234 0.5992 8.7147 4.9979 3.5411 2.9892 3.2167 8.6508 6.7372 103.8730 0.0407 0.7201 44.8188 12.5027 33.1786 4.1920 44.4606 3.3350 8.6771 28.1616 8.2088 77.9094 96.0295 187.6186 6.9661 0.3188 81.7910 9.9175 175.8576 73.1288 89.3343 0.2584 1.0059 0.7431 12.9072 43.8946 64.5176 10.5017 19.0486 173.0874 5.0169 5.3676 4.2436 0.7695 16.8265 209.5424 47.8795 12.5036 54.8616 5.8021 5.6410 43.6411 7.5470 98.6679 14.7642 52.8693 42.6356 28.3561 414.5857 68.5845 50.1354 17.4538 35.3515 0.2952 13.4875 17.9894 5.9428 11.6246 39.2109
temp: 298.150 k
press: 1.00000 atm
elementType: 53 8 7 7 7 7 7 6 6 6 6 6 6 6 6 6 6 1 1 1 1 1 1 1 1 1 1
symmnumber: 1
zpe: 507277.8 jmol-1
zpe.correction: 0.193212 hartree
zpe.thermalcorrener: 0.209667 hartree
zpe.thermalcorrenthalpy: 0.210611 hartree
zpe.thermalcorrgfe: 0.145597 hartree
zpe.sumelectzpe: -746.224278 hartree
zpe.sumelectthermal: -746.207824 hartree
zpe.sumelectthermalent: -746.206879 hartree
zpe.sumelectthermalfe: -746.271893 hartree
dipole: 2.7660 3.2419 -2.6159
dipole: 5.0004
quadrupole: -104.4436 -106.3098 -113.8958
quadrupole: -1.0199 1.1872 0.1072
quadrupole: 3.7728 1.9066 -5.6794 -1.0199 1.1872 0.1072
hfenergy: -746.4174901 hartree
pointgroup: C01 [X(C10H10I1N5O1)]
dipole: 0.205559 1.9194585 -0.3791665 debye
polarizability: 181.4038478|8.5268488|183.6418356|17.4889545|24.5112522|168.2111718 unknown
InChI: InChI=1S/C10H10IN5O/c11-10(15-16-12,9-13-6-7-14-9)17-8-4-2-1-3-5-8/h1-5,13H,6-7H2
charge 0 multiplicity 1
27 atoms
I  -1.991735 -2.197858 -2.03434
O  0.342213 -0.675187 -1.05383
N  -1.850725 1.198282 -0.986936
N  -2.408253 0.352177 1.084378
N  -0.725829 -1.830722 0.824412
N  -0.038038 -2.896615 0.761088
N  0.541039 -3.914103 0.918632
C  -2.787413 2.233315 -0.495419
C  -1.746555 0.187229 -0.043438
C  -3.106796 1.681247 0.949047
C  -0.889121 -1.015567 -0.353977
C  1.320287 0.15528 -0.398686
C  1.23656 0.60919 0.936739
C  2.418887 0.481482 -1.223743
C  2.28524 1.41676 1.437601
C  3.45401 1.285469 -0.703636
C  3.39152 1.758738 0.629216
H  -3.692689 2.289252 -1.129777
H  -2.311593 3.230373 -0.471869
H  -2.739299 2.357314 1.742088
H  -4.188525 1.533071 1.111232
H  -1.428346 1.177446 -1.912389
H  0.391925 0.347838 1.580217
H  2.446741 0.099874 -2.248799
H  2.230467 1.772796 2.472203
H  4.308807 1.538974 -1.339904
H  4.19732 2.381345 1.03139
