program: Gaussian 09
title: 000011871
version: EM64L-G09RevD.01
frameworkgroup: C1[X(C6H3Cl2NO3)]
method: RPBEPBE
basis: SDD
operation: Freq
keyword: #p
keyword: freq=noraman
keyword: PBEPBE/SDD
title: #p freq=noraman PBEPBE/SDD
converged: NO YES NO NO
title: Mulliken charges:
elementType: Cl Cl O O O N C C C C C C H H H
charge: 0.029378 -0.014439 -0.348617 -0.170166 -0.259938 0.030448 0.335870 0.248195 -0.342450 -0.211569 -0.078283 -0.202628 0.313217 0.291095 0.379887
chargesum: 0.00000
title: Mulliken charges with hydrogens summed into heavy atoms:
elementType: Cl Cl O O O N C C C C C C
charge: 0.029378 -0.014439 0.031269 -0.170166 -0.259938 0.030448 0.335870 0.248195 -0.029233 -0.211569 -0.078283 0.088467
polarizability: 1.44671406e+02 -4.14936194e-01 1.46130320e+02 -1.22616340e-02 -2.80486633e-04 3.69282143e+01
1716.lowfreq: -10.9219 -5.6500 -0.8365 -0.0021 -0.0014 0.0019 69.2240 114.3122 136.9890
frequency: 69.2062 114.3096 136.9881 169.3175 181.6664 195.2526 317.5124 335.8321 349.7183 362.3558 404.7020 430.0092 460.8828 550.2223 599.4612 669.7094 680.2808 718.3463 722.0521 813.1830 842.3246 857.8312 878.9914 902.6351 1073.0010 1108.2433 1155.1499 1165.8682 1260.9594 1296.5163 1358.1872 1397.6438 1412.7929 1482.1760 1558.5273 1605.8136 2949.4205 3181.9062 3192.1079
redmass: 13.4080 15.6617 10.9129 21.6505 19.2112 4.8726 8.6073 8.7252 17.2314 10.5079 7.9920 11.0452 5.4870 3.8079 6.1194 9.3979 10.9739 8.3419 10.5322 8.5503 1.0666 8.7424 1.4232 1.3579 2.0547 5.2498 3.8345 2.2524 2.7911 1.9808 6.4781 4.5099 3.9215 4.0551 5.3594 7.2226 1.0660 1.0936 1.0931
irintensity: 0.2760 0.2775 1.5265 0.8022 0.8141 1.0308 10.0000 0.0891 2.8558 6.6581 0.8541 1.8375 5.4839 12.1609 11.3747 0.3551 28.8105 13.3736 61.8682 9.5711 147.4017 19.3056 23.7328 9.7777 7.9924 25.0991 316.7090 87.6830 149.3123 140.0486 100.9346 102.0156 67.2714 111.8617 2.2377 10.1070 172.5429 1.9659 12.9701
temp: 298.150 k
press: 1.00000 atm
elementType: 17 17 8 8 8 7 6 6 6 6 6 6 1 1 1
symmnumber: 1
zpe: 221076.5 jmol-1
zpe.correction: 0.084204 hartree
zpe.thermalcorrener: 0.094574 hartree
zpe.thermalcorrenthalpy: 0.095518 hartree
zpe.thermalcorrgfe: 0.047077 hartree
zpe.sumelectzpe: -1430.030672 hartree
zpe.sumelectthermal: -1430.020302 hartree
zpe.sumelectthermalent: -1430.019358 hartree
zpe.sumelectthermalfe: -1430.067799 hartree
dipole: 2.2167 0.6074 0.0030
dipole: 2.2984
quadrupole: -88.0015 -89.7509 -81.7236
quadrupole: -1.7443 0.0015 0.0035
quadrupole: -1.5095 -3.2589 4.7684 -1.7443 0.0015 0.0035
hfenergy: -1430.1148756 hartree
pointgroup: C01 [X(C6H3Cl2N1O3)]
dipole: 0.8923104 -0.1453035 0.0182244 debye
dipolederiv: -0.167158 -0.2695976 0.0039008 -0.2372776 -0.5937637 0.0099994 0.002918 0.0091861 -0.0109725 -0.3813202 0.3071827 -0.0124356 0.3839126 -0.4833144 0.016341 -0.0142494 0.0153477 -0.0387933 -0.6326702 0.5032173 -0.0171818 0.3087091 -0.8582885 0.0172533 -0.0122415 0.02103 -0.3441692 -0.6140581 -0.2245221 -0.0010096 -0.3986555 -0.7843652 0.0071759 0.0032072 0.0099192 -0.2021079 -0.7832102 0.1431603 -0.0108662 0.3532321 -0.60456 0.0126057 -0.0158962 0.0093768 -0.2677986 1.8782491 0.3173726 0.0170993 0.2290923 1.1094259 -0.0162095 0.0191069 -0.0149789 0.212803 -0.9360587 -0.3833717 -0.0052133 -0.047059 -0.0505097 0.0010278 -0.013305 -0.0036734 0.0292517 0.518692 -0.7586549 0.0245274 -0.2555065 0.5012506 -0.0132444 0.0125613 -0.0210369 0.1462934 0.1593201 0.332607 -0.0046462 -0.1784676 -0.3093104 0.0032476 0.0074892 0.0110235 -0.0584935 0.1641165 0.7940934 -0.0150691 0.4588079 0.9042816 -0.015889 -0.00667 -0.0108154 -0.0926473 0.2671908 -0.742509 0.0229364 -0.8051017 0.6458748 -0.0293736 0.0241013 -0.028426 -0.0820645 -0.0395638 0.0408072 -0.0011865 0.246407 -0.1296063 0.0059595 -0.0061773 0.0028529 -0.0145331 0.1251568 -0.0413542 0.0000956 0.0202243 0.1063474 0.0022153 -0.0012532 0.0009964 0.1834842 0.0480436 -0.0181224 -0.0014124 -0.0075112 0.1165019 0.0010211 -0.0016337 0.0008598 0.1638278 0.3932704 -0.0003087 0.0004612 -0.0708061 0.4300361 -0.0021301 0.0020424 -0.001662 0.3759198 unknown
polarizability: 144.5854502|0.3194535|146.1304107|1.6210928|-2.5857572|37.0140789 unknown
InChI: InChI=1S/C6H3Cl2NO3/c7-3-1-4(8)6(10)5(2-3)9(11)12/h1-2,10H
charge 0 multiplicity 1
15 atoms
Cl 1.924844 2.855428 -0.068926
Cl 2.664084 -2.636637 0.072047
O  -0.970363 2.159337 -0.099402
O  -2.593596 -1.722022 -0.030626
O  -2.926461 0.531843 -0.086213
N  -2.134898 -0.52708 -0.050901
C  -0.693493 -0.29828 -0.034862
C  -0.184673 1.045836 -0.059725
C  0.158404 -1.431538 0.006172
C  1.23384 1.193467 -0.041393
C  1.536492 -1.218735 0.021439
C  2.090859 0.086916 -0.001662
H  -0.281321 -2.431124 0.023922
H  3.174234 0.232337 0.012127
H  -1.945751 1.840652 -0.104496
