program: Gaussian 09
title: 000132933
version: EM64L-G09RevD.01
frameworkgroup: C1[X(C19H18N2O5S)]
method: RPBEPBE
basis: SDD
operation: Freq
keyword: #p
keyword: freq=noraman
keyword: PBEPBE/SDD
title: #p freq=noraman PBEPBE/SDD
converged: YES YES NO NO
title: Mulliken charges:
elementType: S O O O O O N N C C C C C C C C C C C C C C C C C C C H H H H H H H H H H H H H H H H H H
charge: 0.954498 -0.246371 -0.519176 -0.535354 -0.419226 -0.193432 -0.551293 -0.082639 0.274014 -0.217842 0.556335 -0.068601 -0.462232 -0.610334 0.350940 -0.320318 0.146671 -0.253611 -0.224255 -0.304971 0.452002 -0.361914 -0.366308 -0.784126 -0.798705 -0.339353 0.158526 0.323889 0.313061 0.266180 0.249717 0.283970 0.279733 0.236892 0.244275 0.244469 0.248188 0.229024 0.233733 0.242442 0.231323 0.231642 0.262173 0.255939 0.390426
chargesum: 0.00000
title: Mulliken charges with hydrogens summed into heavy atoms:
elementType: S O O O O O N N C C C C C C C C C C C C C C C C C C C
charge: 0.954498 -0.246371 -0.519176 -0.535354 -0.028800 -0.193432 -0.227405 -0.082639 0.274014 -0.217842 0.556335 -0.068601 -0.149171 -0.344154 0.350940 -0.070602 0.146671 0.030358 0.055477 -0.068079 0.452002 -0.117639 -0.121839 -0.073181 -0.093298 0.178760 0.158526
polarizability: 3.46432216e+02 -1.92963379e+01 2.85986377e+02 1.25786895e+01 3.19510886e+01 2.28032634e+02
1716.lowfreq: -12.2307 -5.3586 0.0015 0.0016 0.0017 1.3758 8.0043 10.1278 14.9591
frequency: -12.1799 9.4024 14.9299 21.4741 26.8798 37.3157 52.5631 61.7721 70.7886 82.2351 95.7689 123.7233 128.1869 129.7721 151.4516 178.5632 185.7296 210.1042 215.0012 223.0191 241.8301 251.3507 282.6108 293.1160 320.2841 362.3841 366.1685 383.4403 407.1200 409.8665 430.8039 437.9924 457.3739 466.3926 500.0972 504.5913 512.1700 538.5580 555.8514 577.1933 580.6111 588.0610 618.1498 621.2528 627.4333 661.5409 672.4253 701.7787 705.8134 775.1554 799.5128 809.0224 821.5194 821.9157 824.9507 847.0429 853.7653 880.4489 889.0895 893.7056 912.3870 952.4838 960.7924 965.4261 981.6051 984.0205 991.1511 991.4832 1000.3312 1002.3467 1025.5331 1044.8243 1048.3672 1049.9574 1057.2448 1082.3060 1119.1506 1142.5688 1170.2559 1184.7713 1207.7314 1218.2015 1230.4185 1241.3734 1260.1352 1273.5601 1296.1866 1296.6619 1327.7488 1364.3286 1380.6930 1385.2586 1391.3225 1391.9215 1399.3713 1404.6126 1428.6997 1448.1105 1456.1943 1466.2147 1470.6967 1471.0780 1474.0300 1479.0076 1495.0249 1552.6725 1593.0278 1593.8400 1597.0967 1621.7351 1702.6208 2970.8164 2980.4010 2981.1226 3029.6235 3057.6334 3063.2091 3092.8182 3115.5731 3131.7731 3135.7775 3137.7363 3157.1070 3159.9791 3161.1621 3166.9888 3187.7207 3297.7764 3526.8270
redmass: 1.0304 5.4317 5.8592 9.4898 6.5116 4.1333 7.2534 4.6308 1.1319 3.8093 5.6211 2.5255 5.2955 6.2063 8.3503 4.6966 10.1557 7.1896 5.1670 7.5959 5.7286 5.6331 5.3170 4.8322 4.1984 3.8403 4.2205 4.4155 2.9282 5.9848 5.4784 6.1594 5.4057 5.2120 5.0955 3.3661 1.8259 3.5115 4.5580 5.4220 5.9397 5.0828 3.9370 6.7735 1.5209 6.4131 3.2907 4.9298 3.5573 4.9532 3.8885 9.5305 1.3578 4.2605 1.3796 1.2490 1.6090 4.0689 1.6834 1.7734 3.8576 7.6135 1.3027 4.6107 1.3869 1.3533 1.9519 2.8589 1.8512 1.8949 2.9478 1.5782 2.4337 1.5916 2.4774 4.1169 1.2853 1.7439 1.5260 1.1400 1.0768 3.0012 2.1262 1.5675 1.6553 1.8194 2.6630 1.5537 2.9248 2.7185 6.0874 1.9281 2.9683 1.2708 1.2190 3.8246 4.0440 1.2857 1.2692 1.0468 1.1843 2.0537 1.0567 2.1205 3.6700 6.3200 6.6691 6.1865 6.4546 6.6217 9.2974 1.0562 1.0390 1.0384 1.1037 1.0971 1.0947 1.1001 1.0980 1.0878 1.0890 1.0895 1.0981 1.0923 1.0957 1.0960 1.0918 1.0737 1.0643
irintensity: 0.3190 0.8670 0.9742 0.4016 1.4757 0.1258 2.6106 1.0975 0.4042 0.7029 0.2690 9.5328 1.9926 1.3643 1.5729 5.7033 1.1183 3.3171 13.5125 4.0051 0.4251 6.1784 0.3118 0.6195 4.0743 1.0385 22.9654 4.9142 0.4250 10.6731 6.0493 71.7677 12.3865 10.6959 6.0230 105.5016 33.0095 6.9080 37.3357 4.9613 16.9420 9.6729 10.8497 0.2890 126.0190 17.6811 7.5173 7.7540 5.3381 4.4486 22.7322 70.2155 6.1901 22.6970 25.9522 0.2721 29.6585 0.1206 106.0402 111.8795 5.1665 44.7698 1.7665 19.8591 0.3151 1.5244 2.3375 5.8057 42.5733 0.3173 352.9131 7.9969 20.0821 12.4453 103.9678 19.7806 7.0261 83.8207 91.7330 10.3648 0.7511 6.7026 50.2798 28.2332 19.8635 6.0296 37.6734 26.2911 70.8024 14.2597 0.2165 59.4852 7.3700 19.7014 16.9296 10.5002 35.6190 100.7159 7.6137 14.6262 15.7545 23.3402 13.9270 4.9365 77.5339 56.1975 2.8935 7.2376 76.5987 115.7849 211.1669 39.7417 22.2250 24.7434 11.3151 16.6074 20.0852 13.5274 8.5012 4.1252 12.7584 7.2055 23.8524 2.3685 4.2133 6.1029 1.6775 78.1431 39.3253
temp: 298.150 k
press: 1.00000 atm
elementType: 16 8 8 8 8 8 7 7 6 6 6 6 6 6 6 6 6 6 6 6 6 6 6 6 6 6 6 1 1 1 1 1 1 1 1 1 1 1 1 1 1 1 1 1 1
symmnumber: 1
zpe: 874779.4 jmol-1
zpe.correction: 0.333186 hartree
zpe.thermalcorrener: 0.358994 hartree
zpe.thermalcorrenthalpy: 0.359938 hartree
zpe.thermalcorrgfe: 0.272723 hartree
zpe.sumelectzpe: -1616.406750 hartree
zpe.sumelectthermal: -1616.380942 hartree
zpe.sumelectthermalent: -1616.379998 hartree
zpe.sumelectthermalfe: -1616.467213 hartree
dipole: -3.5226 2.8038 5.2278
dipole: 6.8993
quadrupole: -138.9912 -157.3723 -174.5988
quadrupole: -13.9868 -17.1496 -12.4515
quadrupole: 17.9962 -0.3848 -17.6114 -13.9868 -17.1496 -12.4515
hfenergy: -1616.7399357 hartree
pointgroup: C01 [X(C19H18N2O5S1)]
dipole: -1.4067685 -0.9576633 -2.1146608 debye
polarizability: 351.5578878|5.4839968|284.6299419|1.6519002|31.1322106|224.2633978 unknown
InChI: InChI=1S/C19H18N2O5S/c1-12-3-7-16(8-4-12)27(24,25)21-17-10-15(26-11-18(22)23)9-14-6-5-13(2)20-19(14)17/h3-10,21-22H,11H2,1-2H3
charge 0 multiplicity 1
45 atoms
S  -0.674667 2.103048 1.615579
O  3.642737 -1.065418 -0.258433
O  -1.566167 2.720523 2.819606
O  0.842326 2.592392 1.290067
O  6.44266 1.149176 0.37124
O  6.239558 -0.63031 -1.121219
N  -0.524936 0.231078 2.067504
N  -1.798565 -1.902654 0.893608
C  0.210959 -0.589424 1.19074
C  -0.455758 -1.731283 0.605089
C  0.303386 -2.636085 -0.223908
C  -1.671627 2.257873 0.014789
C  1.574118 -0.356386 0.932028
C  1.676255 -2.372274 -0.492518
C  2.288696 -1.242007 0.073029
C  -0.409156 -3.770958 -0.743276
C  -2.443093 -2.973411 0.383515
C  -3.064566 2.404538 0.119107
C  -0.983552 2.232287 -1.208906
C  -1.759369 -3.936542 -0.442895
C  -3.159095 2.491842 -2.345877
C  -3.80153 2.526059 -1.078753
C  -1.746457 2.351041 -2.391662
C  -3.912124 -3.139675 0.705808
C  -3.969071 2.593061 -3.625114
C  4.327828 0.086567 0.308542
C  5.741305 0.107237 -0.255475
H  -1.500693 -0.125153 2.163293
H  2.048174 0.505557 1.405809
H  2.267682 -3.037233 -1.129287
H  0.12021 -4.497348 -1.370364
H  -3.546755 2.453749 1.100866
H  0.107707 2.153053 -1.231889
H  -2.318505 -4.79582 -0.827758
H  -4.888829 2.654602 -1.028146
H  -1.23517 2.340983 -3.361025
H  -4.258644 -2.298277 1.325365
H  -4.522465 -3.178615 -0.216025
H  -4.094794 -4.081689 1.256648
H  -4.283382 1.589303 -3.971199
H  -4.885054 3.191172 -3.478878
H  -3.384899 3.052861 -4.440769
H  3.825021 1.038489 0.041719
H  4.383496 0.028831 1.413726
H  7.367403 1.19684 0.006901
