program: Gaussian 09
title: 000132856
version: EM64L-G09RevD.01
frameworkgroup: C1[X(C12H21NO4S)]
method: RPBEPBE
basis: SDD
operation: Freq
keyword: #p
keyword: freq=noraman
keyword: PBEPBE/SDD
title: #p freq=noraman PBEPBE/SDD
converged: YES YES NO NO
title: Mulliken charges:
elementType: S O O O O N C C C C C C C C C C C C H H H H H H H H H H H H H H H H H H H H H
charge: 0.125591 -0.441429 -0.266336 -0.238734 -0.281518 -0.393354 -0.514759 -0.033315 -0.350169 -0.419692 -0.395443 -0.392765 -0.629375 -0.138642 0.218478 0.261633 -0.771114 -0.504063 0.271937 0.196997 0.209472 0.225467 0.209735 0.224737 0.202897 0.196491 0.195440 0.208801 0.314395 0.274260 0.334781 0.293872 0.344183 0.254278 0.252950 0.218248 0.249643 0.237035 0.249389
chargesum: 0.00000
title: Mulliken charges with hydrogens summed into heavy atoms:
elementType: S O O O O N C C C C C C C C C C C C
charge: 0.125591 -0.106648 -0.266336 -0.238734 -0.281518 -0.049172 -0.242822 0.163682 0.084771 0.014780 0.003945 0.011476 -0.040721 0.155230 0.218478 0.261633 -0.045638 0.232003
polarizability: 2.02597435e+02 1.55906732e+01 1.63024893e+02 2.43244747e+00 -2.05738269e-01 1.34629823e+02
1716.lowfreq: -17.8975 -0.0016 -0.0004 0.0018 4.7814 10.5195 13.2399 29.4118 40.5999
frequency: -8.8885 28.5367 40.5220 49.6477 70.9483 76.5538 76.9396 86.1652 101.9911 111.2406 141.6893 155.1294 173.4050 182.7865 210.7180 235.6687 277.4828 297.3581 312.6579 319.3591 347.0609 362.6633 391.0194 419.8253 454.3645 462.5683 476.7076 500.9066 537.9239 566.8089 589.8257 616.4574 633.8388 656.3284 702.6542 754.8413 789.8323 816.7831 834.2218 860.8382 883.2613 903.7519 922.2597 937.5203 948.1910 952.6520 993.0323 1014.2849 1023.3778 1044.3229 1046.4376 1053.8595 1098.4491 1105.1248 1114.8695 1118.6229 1129.1302 1151.5708 1164.0293 1178.9241 1195.1820 1202.9471 1229.7829 1239.7910 1250.3776 1257.0958 1264.6140 1288.3878 1309.3909 1317.3858 1322.9024 1328.6769 1335.9300 1339.5426 1350.7197 1380.4512 1389.0736 1423.1396 1435.4801 1450.9976 1453.5096 1460.3317 1463.1057 1464.3084 1467.2328 1471.4974 1477.8065 1484.2774 1604.2616 1640.0610 2918.7076 2972.9154 2973.9470 2978.6367 2981.5382 2992.4733 2999.1445 3009.7401 3017.6293 3034.9846 3040.5782 3046.9495 3051.2137 3062.4330 3097.9487 3105.8266 3114.7875 3127.8014 3155.6039 3464.0590 3520.7488
redmass: 5.0384 4.8534 4.3825 4.9116 5.0187 3.1297 2.7016 1.3222 1.2260 3.9218 4.5483 4.6153 3.3073 2.6274 4.4762 5.5306 5.0175 3.4756 3.2626 1.9980 3.9044 2.9722 3.4192 3.6358 2.7560 2.3079 1.4947 3.5808 2.2398 4.3023 2.4558 1.6293 4.4032 3.7400 3.1094 5.8791 1.9267 4.3421 1.8848 1.7077 1.9451 2.0565 4.1511 2.3560 2.1836 6.0171 1.6148 2.2664 2.6718 1.6542 1.5108 1.9694 2.0096 1.7537 1.2640 1.9586 1.7552 1.4356 3.3471 1.6760 1.3223 1.4415 1.3009 1.2757 1.6891 1.2506 1.2099 1.2866 1.3112 1.4314 1.3804 1.5820 1.4090 1.4541 1.3917 1.6077 1.2306 1.1742 1.1116 1.0484 1.0496 1.0651 1.0885 1.1575 1.0814 1.0791 1.0918 1.9648 6.9873 8.8450 1.0830 1.0635 1.0625 1.0810 1.0622 1.0624 1.0359 1.0293 1.0854 1.0965 1.0991 1.0576 1.1009 1.1020 1.0984 1.1006 1.1050 1.1086 1.1054 1.0648 1.0783
irintensity: 0.1345 0.2992 0.2278 1.1008 8.6313 3.3646 2.6982 0.6012 0.4878 6.9162 7.3539 6.1044 1.3311 0.2769 3.1670 16.7794 7.5768 0.1889 1.8501 0.8856 12.5642 1.4337 18.3708 3.9141 5.6597 50.6618 96.4385 3.0482 4.9202 18.5267 92.3979 44.3293 2.0387 2.9569 20.7544 4.9681 1.9105 8.8148 11.8750 7.6161 1.5327 10.0205 10.1660 4.0995 32.4542 24.3337 3.6627 4.7943 64.2647 16.0721 8.7033 2.0523 13.4348 8.3398 0.1057 7.4830 1.6671 0.9690 213.7178 5.6756 15.3531 3.0188 17.5930 0.0171 6.6664 16.4070 23.7775 6.1405 52.6097 86.5911 8.8256 41.0154 0.8469 1.9217 15.3352 26.8287 69.3967 15.4672 40.5439 19.9409 17.1730 21.7964 4.8137 87.5379 9.4015 13.9574 3.8003 249.2554 212.5722 111.2150 36.7687 31.3951 38.6604 13.9551 17.6505 20.2531 8.7221 22.9474 13.0478 51.5383 52.2415 13.5300 32.4650 59.3134 10.4328 16.1606 24.6881 2.1095 11.1739 21.3676 61.1122
temp: 298.150 k
press: 1.00000 atm
elementType: 16 8 8 8 8 7 6 6 6 6 6 6 6 6 6 6 6 6 1 1 1 1 1 1 1 1 1 1 1 1 1 1 1 1 1 1 1 1 1
symmnumber: 1
zpe: 846201.6 jmol-1
zpe.correction: 0.322301 hartree
zpe.thermalcorrener: 0.342170 hartree
zpe.thermalcorrenthalpy: 0.343114 hartree
zpe.thermalcorrgfe: 0.272588 hartree
zpe.sumelectzpe: -1222.166711 hartree
zpe.sumelectthermal: -1222.146842 hartree
zpe.sumelectthermalent: -1222.145898 hartree
zpe.sumelectthermalfe: -1222.216424 hartree
dipole: 1.1527 4.6738 -1.0565
dipole: 4.9285
quadrupole: -115.7302 -115.2988 -120.6439
quadrupole: 7.9352 8.1742 8.8149
quadrupole: 1.4941 1.9255 -3.4196 7.9352 8.1742 8.8149
hfenergy: -1222.4890122 hartree
pointgroup: C01 [X(C12H21N1O4S1)]
dipole: 0.1818505 1.9201876 -0.1989559 debye
polarizability: 196.3120138|20.1576305|168.1543296|8.1282258|4.96059|135.785807 unknown
InChI: InChI=1S/C12H21NO4S/c1-8(14)13-9(12(16)17-2)7-18-11-6-4-3-5-10(11)15/h9-11,13,15H,3-7H2,1-2H3
charge 0 multiplicity 1
39 atoms
S  0.426495 -0.857838 -0.551684
O  3.077141 -2.535248 -0.123097
O  -1.306027 2.180878 0.817463
O  -2.308831 1.735906 -1.236357
O  -3.480016 -2.446179 0.990044
N  -2.82155 -0.848397 -0.551372
C  2.057213 -0.303937 0.305404
C  3.218506 -1.092501 -0.34031
C  2.263105 1.218866 0.204884
C  4.56496 -0.674375 0.279705
C  3.62173 1.632053 0.827578
C  4.78979 0.852303 0.177179
C  -0.777505 -0.696608 0.90744
C  -2.114023 -0.056666 0.458413
C  -1.92975 1.356198 -0.104818
C  -3.489168 -2.010131 -0.204512
C  -4.217219 -2.722442 -1.337342
C  -1.0798 3.582573 0.377888
H  1.962607 -0.629168 1.359151
H  3.229133 -0.864835 -1.43205
H  2.238515 1.513703 -0.863431
H  1.4243 1.740411 0.703909
H  4.566017 -0.991495 1.341232
H  5.372751 -1.233995 -0.226091
H  3.769925 2.722381 0.706718
H  3.607278 1.427409 1.91788
H  4.877158 1.146669 -0.888973
H  5.74746 1.121909 0.661274
H  -0.98574 -1.695346 1.319751
H  -0.301293 -0.059129 1.669353
H  2.141678 -2.77862 -0.366163
H  -2.746504 0.003748 1.368973
H  -2.877791 -0.448633 -1.492534
H  -3.764275 -3.7177 -1.489229
H  -5.268351 -2.883436 -1.043617
H  -4.189297 -2.169954 -2.291888
H  -2.041802 4.058241 0.125898
H  -0.606179 4.07234 1.239502
H  -0.42064 3.597247 -0.50577
