program: Gaussian 09
title: 000132845
version: EM64L-G09RevD.01
frameworkgroup: C1[X(C17H17N2)]
method: RPBEPBE
basis: SDD
operation: Freq
keyword: #p
keyword: freq=noraman
keyword: PBEPBE/SDD
title: #p freq=noraman PBEPBE/SDD
converged: YES YES NO NO
title: Mulliken charges:
elementType: N N C C C C C C C C C C C C C C C C C H H H H H H H H H H H H H H H H H
charge: -0.140548 -0.116538 -0.374535 -0.389199 -0.463270 0.252518 0.302370 0.076026 0.336557 -0.363352 -0.526117 0.444331 -0.284390 -0.337356 -0.382122 -0.802797 -0.241080 -0.225863 -0.213702 0.270519 0.293801 0.276283 0.275435 0.271796 0.274701 0.263708 0.275478 0.257908 0.228973 0.260855 0.235738 0.248126 0.249626 0.253069 0.254167 0.258884
chargesum: 1.00000
title: Mulliken charges with hydrogens summed into heavy atoms:
elementType: N N C C C C C C C C C C C C C C C C C
charge: -0.140548 -0.116538 0.189785 0.162519 0.083227 0.252518 0.302370 0.076026 0.336557 -0.099645 -0.250638 0.444331 -0.026481 -0.108383 -0.121267 -0.069307 0.011988 0.028304 0.045182
polarizability: 2.79552175e+02 -3.52808973e+00 2.27004931e+02 -5.60515376e+00 -1.33492930e+01 1.04467674e+02
1716.lowfreq: -4.8666 -0.0005 -0.0003 0.0003 7.9728 9.8972 54.7670 66.2839 71.3643
frequency: 54.7428 66.2792 71.3613 80.5134 93.0868 135.3037 154.3527 179.9533 203.6401 218.1082 257.0330 293.7904 318.8075 345.3096 387.0139 401.5187 414.1024 429.0386 479.3755 557.6815 568.7857 581.0310 611.4282 631.0822 653.6470 663.1728 699.6802 702.1390 742.4097 758.2257 785.6976 816.9671 835.9709 853.5089 868.6129 892.4090 901.5075 915.0135 935.9921 951.6361 957.7317 977.5231 985.0668 990.7799 1013.4800 1014.4672 1024.4009 1030.0407 1052.1677 1073.2457 1092.2536 1117.1018 1157.5739 1166.2607 1178.4780 1184.9848 1196.0111 1198.5054 1215.4186 1233.8383 1244.3964 1287.8589 1313.8840 1316.6600 1328.6365 1338.3918 1369.6900 1381.6614 1393.8282 1407.2681 1423.1799 1434.2595 1443.1235 1463.2577 1467.5917 1472.2449 1478.0616 1482.9921 1494.0055 1510.2251 1528.4227 1572.4228 1581.7585 1609.1065 1638.8243 2987.6479 3015.6473 3028.0644 3052.8111 3066.3550 3094.8014 3100.7379 3107.8071 3131.6833 3136.4431 3144.5950 3145.0143 3155.2582 3162.2068 3166.0969 3172.8679 3180.0807
redmass: 3.7190 4.0316 3.5242 2.8944 1.1830 2.4949 3.0621 3.7919 2.6583 2.9939 4.1457 4.5863 4.2919 3.8134 5.4228 2.8673 4.3556 3.1777 3.8450 3.5085 4.3880 4.1916 6.3230 3.5022 5.6590 5.1607 2.4847 2.2414 3.0459 5.2578 2.2461 1.3905 4.5163 1.2645 2.0333 1.3791 1.4600 2.6753 1.4391 2.7853 3.4547 1.3369 2.0852 2.4542 1.4122 1.5390 2.3870 2.1632 1.5625 3.8807 1.6368 1.7351 2.2784 1.4924 1.1850 1.0564 1.8132 1.2420 1.3395 1.8299 2.1058 1.6469 1.2308 1.6887 1.3295 2.0421 2.0043 5.2208 2.9052 1.2425 4.0525 3.6120 2.7603 1.8105 1.0441 1.5877 1.1506 1.1140 1.1081 3.1337 6.1410 6.2203 5.8749 5.9723 7.4849 1.0383 1.0631 1.0630 1.0641 1.0975 1.1028 1.0991 1.1034 1.1059 1.0882 1.0893 1.0879 1.0919 1.0932 1.0963 1.0973 1.1017
irintensity: 0.0382 2.7287 0.4310 1.6155 0.0023 0.0415 0.9588 2.0904 2.3348 0.9737 0.6278 0.1379 1.5854 0.5488 1.5352 0.7285 1.1771 5.3493 4.1416 11.2797 5.9128 6.6822 0.3743 6.5706 7.1042 2.2451 19.5236 28.1688 21.9999 0.8818 34.7443 47.9663 1.1438 4.2236 4.5121 2.0116 0.2335 0.0813 0.5033 15.6947 5.2480 0.5995 5.9482 0.8145 4.4283 8.7981 2.7602 3.9715 10.4638 1.9733 12.9771 1.4724 8.7576 2.0972 6.0678 0.0686 37.1133 3.6004 4.4670 12.3218 40.2510 4.1481 9.1632 28.8865 4.2836 43.1893 11.1252 2.9704 5.9244 27.7940 34.4921 11.4586 7.9158 48.9059 16.4616 25.4067 9.0036 19.9809 1.7710 55.4952 43.6285 49.8127 5.4959 21.3496 13.8014 10.6396 20.6300 8.3989 8.1216 8.7224 3.0031 9.1878 1.0095 7.1771 5.8844 4.7256 0.3733 3.5835 0.8762 12.7276 2.9352 7.9118
temp: 298.150 k
press: 1.00000 atm
elementType: 7 7 6 6 6 6 6 6 6 6 6 6 6 6 6 6 6 6 6 1 1 1 1 1 1 1 1 1 1 1 1 1 1 1 1 1
symmnumber: 1
zpe: 784745.1 jmol-1
zpe.correction: 0.298894 hartree
zpe.thermalcorrener: 0.314587 hartree
zpe.thermalcorrenthalpy: 0.315531 hartree
zpe.thermalcorrgfe: 0.255636 hartree
zpe.sumelectzpe: -765.964075 hartree
zpe.sumelectthermal: -765.948382 hartree
zpe.sumelectthermalent: -765.947438 hartree
zpe.sumelectthermalfe: -766.007333 hartree
dipole: -0.8641 4.5730 0.2079
dipole: 4.6585
quadrupole: -65.1143 -62.7906 -109.0561
quadrupole: -1.8455 -1.4405 -3.0070
quadrupole: 13.8727 16.1964 -30.0691 -1.8455 -1.4405 -3.0070
hfenergy: -766.2629691 hartree
pointgroup: C01 [X(C17H17N2)]
dipole: 0.4662102 -1.7662975 -0.1483032 debye
polarizability: 279.4378419|-1.3080717|220.8050167|8.9861982|29.667889|110.7819224 unknown
InChI: InChI=1S/C17H17N2/c1-13-8-9-16-15(12-13)17(14-6-3-2-4-7-14)19-11-5-10-18(16)19/h2-4,6-9,12H,5,10-11H2,1H3
charge 1 multiplicity 1
36 atoms
N  -0.050925 -1.547263 -0.24383
N  1.333911 -1.724388 -0.220759
C  -0.744391 -2.850737 -0.389325
C  1.710849 -3.145097 -0.350292
C  0.372174 -3.867835 -0.007431
C  -0.381214 -0.22706 -0.073364
C  1.92987 -0.491637 -0.042049
C  0.869034 0.482632 0.053033
C  -1.766232 0.260115 -0.027298
C  3.294617 -0.125682 0.033071
C  1.192947 1.861756 0.198833
C  2.541921 2.246148 0.273987
C  3.570016 1.238017 0.197636
C  -2.767777 -0.264834 -0.892973
C  -2.115345 1.283939 0.898635
C  2.943461 3.699543 0.42524
C  -4.087936 0.224333 -0.831278
C  -3.438646 1.764981 0.958203
C  -4.428097 1.238377 0.094835
H  -1.080182 -2.978879 -1.432984
H  -1.618896 -2.88708 0.278235
H  2.516071 -3.391577 0.359851
H  2.057085 -3.3575 -1.37791
H  0.265443 -4.811302 -0.562679
H  0.328718 -4.09124 1.070567
H  4.099143 -0.862507 -0.039602
H  0.401771 2.616348 0.232196
H  4.61579 1.560278 0.25986
H  -2.510671 -1.016563 -1.647893
H  -1.364065 1.672679 1.593805
H  2.066895 4.366024 0.470893
H  3.535012 3.855916 1.34617
H  3.573363 4.02936 -0.421499
H  -4.847668 -0.174778 -1.510549
H  -3.700453 2.543962 1.681044
H  -5.454292 1.616352 0.14142
