program: Gaussian 09
title: 000132858
version: EM64L-G09RevD.01
frameworkgroup: C1[X(C21H13BrO5)]
method: RPBEPBE
basis: SDD
operation: Freq
keyword: #p
keyword: freq=noraman
keyword: PBEPBE/SDD
title: #p freq=noraman PBEPBE/SDD
converged: YES YES NO NO
title: Mulliken charges:
elementType: Br O O O O O C C C C C C C C C C C C C C C C C C C C C H H H H H H H H H H H H H
charge: -0.029696 -0.220455 -0.271330 -0.210797 -0.423030 -0.423399 -0.073589 0.301644 0.355093 0.350755 0.092105 0.157197 0.155572 0.095770 -0.397804 -0.332133 -0.321726 -0.515009 0.541585 -0.334625 -0.545547 -0.510982 -0.393578 -0.431147 0.314666 0.323981 -0.868510 0.261678 0.247119 0.248964 0.276419 0.243955 0.258820 0.286179 0.257870 0.228921 0.289421 0.293028 0.361398 0.361216
chargesum: 0.00000
title: Mulliken charges with hydrogens summed into heavy atoms:
elementType: Br O O O O O C C C C C C C C C C C C C C C C C C C C C
charge: -0.029696 -0.220455 -0.271330 -0.210797 -0.061631 -0.062183 -0.073589 0.301644 0.355093 0.350755 0.092105 0.157197 0.155572 0.095770 -0.136126 -0.085014 -0.072763 -0.238589 0.541585 -0.090670 -0.286727 -0.224803 -0.135708 -0.202226 0.314666 0.323981 -0.286061
polarizability: 3.50848318e+02 1.57320349e+01 2.97686957e+02 2.24532435e+01 -3.04528709e+00 1.75003716e+02
1716.lowfreq: -4.5484 -0.0006 -0.0004 -0.0002 0.9250 3.9904 19.2558 22.7833 31.8036
frequency: 19.2151 22.7809 31.7188 49.5866 55.2147 66.0071 99.2609 127.4766 139.3630 172.5746 178.7522 189.6096 214.4183 241.6175 263.1141 272.3523 299.9428 319.8790 330.9716 341.9758 362.7095 366.4803 374.0669 377.7014 412.3257 417.7675 456.8740 461.9758 468.4896 485.5648 504.1506 523.9803 552.4020 588.5661 590.9298 597.0948 602.7772 611.5621 621.4270 655.1680 679.8890 703.1289 710.1153 717.8621 735.6399 744.3714 747.8066 762.4675 774.6582 805.1596 827.4942 838.5345 845.4121 859.6434 865.3950 885.1911 914.7062 917.7907 933.5805 943.7452 949.2143 959.1595 974.9531 977.3091 1030.3938 1081.3595 1098.4790 1102.4125 1117.1726 1132.5810 1147.1636 1158.3074 1164.2033 1176.5759 1191.8549 1210.5057 1218.6771 1231.9011 1256.4219 1266.7085 1277.9676 1282.1796 1291.1046 1310.6135 1394.1837 1397.0157 1408.5021 1430.4954 1431.3567 1452.1079 1460.7060 1485.2079 1495.7307 1500.2978 1581.9709 1595.3601 1602.8516 1625.2056 1628.9204 1646.5297 1682.5197 3068.6485 3128.7948 3133.7904 3143.9380 3146.0838 3148.1072 3152.6700 3154.4168 3158.1871 3182.8790 3189.8945 3582.6228 3585.5214
redmass: 9.9373 7.7093 5.5241 7.8265 8.3075 10.6281 5.1676 5.8144 5.5640 6.0626 6.9593 6.2478 6.7749 9.5532 5.0402 6.4134 5.8834 8.0228 5.2763 5.6958 3.7826 1.1310 2.2186 1.6601 4.4990 3.3629 3.3881 4.1334 3.8000 4.8233 8.1030 6.8885 6.4058 7.1824 8.4701 7.6137 4.4626 4.1596 4.5870 5.9572 4.7143 5.8535 6.2213 3.4770 7.8980 7.9142 6.5084 4.8948 2.6075 1.6631 1.8161 1.6722 1.5495 2.6592 1.5752 1.9796 4.5532 5.0062 1.5406 1.4330 4.6169 1.3759 2.2113 1.7026 4.2747 2.6448 1.3623 1.8650 1.9018 1.5952 1.3811 1.5530 1.3163 1.9285 1.7259 1.1490 1.7624 2.2954 2.4594 4.5215 4.3013 1.6474 1.9453 2.1231 6.3826 7.0471 7.3582 4.0654 4.1011 4.0902 1.1380 3.1098 3.1429 3.1674 7.2251 8.1027 7.8705 7.3810 7.0197 7.2560 12.9811 1.0576 1.0883 1.0888 1.0897 1.0935 1.0923 1.1107 1.0962 1.0970 1.0956 1.0930 1.0661 1.0662
irintensity: 0.5336 0.5182 0.4568 1.9448 2.1799 0.9329 1.3977 0.6444 0.0732 1.6110 3.6185 1.8184 5.7170 1.3854 4.6666 1.7630 1.1662 2.3091 0.2809 24.5112 6.6590 137.6402 49.2674 96.7253 24.1224 0.4933 13.8634 21.5381 3.6888 13.2680 11.5998 43.9517 11.7980 8.3601 3.6094 12.3042 57.6744 1.5104 4.0527 20.1445 12.7233 4.4972 22.1631 1.9790 9.9474 2.0168 43.8231 4.9911 122.2116 14.9442 17.4381 59.9553 15.0476 10.3277 40.0259 4.3253 11.8915 0.1327 7.2606 6.4725 7.0406 2.3200 57.7890 38.3768 180.4772 81.0096 46.6322 236.3899 51.3214 439.3710 110.5897 68.7437 21.0076 17.5354 58.4814 41.0637 15.4421 3.7950 57.5842 4.3799 28.6623 1.3370 29.0517 67.9339 10.1259 84.6042 27.1822 17.1860 126.8296 80.6921 8.0660 4.8965 95.5056 37.9623 24.2140 16.9289 118.5926 20.3758 313.6671 79.5707 362.4289 13.8742 10.2904 5.9430 7.1455 2.5490 2.5795 1.5145 7.6014 6.5261 3.2399 0.1583 67.0356 63.1733
temp: 298.150 k
press: 1.00000 atm
elementType: 35 8 8 8 8 8 6 6 6 6 6 6 6 6 6 6 6 6 6 6 6 6 6 6 6 6 6 1 1 1 1 1 1 1 1 1 1 1 1 1
symmnumber: 1
zpe: 746961.3 jmol-1
zpe.correction: 0.284503 hartree
zpe.thermalcorrener: 0.306690 hartree
zpe.thermalcorrenthalpy: 0.307635 hartree
zpe.thermalcorrgfe: 0.230956 hartree
zpe.sumelectzpe: -1195.778604 hartree
zpe.sumelectthermal: -1195.756416 hartree
zpe.sumelectthermalent: -1195.755472 hartree
zpe.sumelectthermalfe: -1195.832151 hartree
dipole: -0.6221 0.2303 -5.3359
dipole: 5.3770
quadrupole: -157.2870 -144.8191 -182.5073
quadrupole: -0.8710 5.5051 5.0590
quadrupole: 4.2508 16.7186 -20.9695 -0.8710 5.5051 5.0590
hfenergy: -1196.063107 hartree
pointgroup: C01 [X(C21H13Br1O5)]
dipole: 0.4305317 -0.0799909 -2.069646 debye
polarizability: 350.9657907|19.0936796|300.1841414|-7.4533009|2.6899272|172.3890582 unknown
InChI: InChI=1S/C21H13BrO5/c22-10-11-1-4-15-14(7-11)20(25)27-21(15)16-5-2-12(23)8-18(16)26-19-9-13(24)3-6-17(19)21/h1-9,23-24H,10H2
charge 0 multiplicity 1
40 atoms
Br -6.392523 -0.721206 -1.206004
O  -0.006216 0.160197 1.948186
O  3.084329 -0.534997 -0.173123
O  -1.825056 0.545934 3.366981
O  4.108193 4.170259 -0.678475
O  2.377034 -5.242674 -0.324494
C  0.238526 0.051392 0.397339
C  -1.166032 0.302496 -0.147248
C  1.250327 1.116638 0.039438
C  0.763968 -1.344495 0.138012
C  -2.081158 0.50171 0.903993
C  2.610758 0.78934 -0.173451
C  2.145382 -1.579466 -0.081407
C  -1.371985 0.419355 2.214064
C  -1.600535 0.346392 -1.485315
C  0.898105 2.4920 -0.007263
C  -0.085771 -2.477491 0.193273
C  -3.446591 0.741822 0.668587
C  -3.901933 0.784773 -0.673321
C  -2.968942 0.589488 -1.735041
C  3.593041 1.771468 -0.41675
C  2.675435 -2.873569 -0.234754
C  1.848598 3.49301 -0.248564
C  0.410147 -3.782371 0.04282
C  3.204605 3.125623 -0.447885
C  1.802377 -3.97478 -0.167583
C  -5.344979 1.043152 -0.97938
H  -0.898402 0.197765 -2.31176
H  -0.145312 2.777926 0.162467
H  -1.156575 -2.330469 0.368645
H  -4.132803 0.884153 1.510945
H  -3.332498 0.618929 -2.769055
H  4.62915 1.454113 -0.576501
H  3.744415 -3.019124 -0.40306
H  1.576647 4.551067 -0.276289
H  -0.269903 -4.640964 0.095415
H  -5.506802 1.554164 -1.938944
H  -5.88008 1.553561 -0.166588
H  5.031801 3.831798 -0.784899
H  1.694657 -5.954919 -0.249009
