program: Gaussian 09
title: 000132821
version: EM64L-G09RevD.01
frameworkgroup: C1[X(C12H15N5O2)]
method: RPBEPBE
basis: SDD
operation: Freq
keyword: #p
keyword: freq=noraman
keyword: PBEPBE/SDD
title: #p freq=noraman PBEPBE/SDD
converged: YES YES NO NO
title: Mulliken charges:
elementType: O O N N N N N C C C C C C C C C C C C H H H H H H H H H H H H H H H
charge: -0.468633 -0.446351 -0.179097 -0.085914 -0.048757 -0.061238 -0.610082 -0.138105 -0.531330 -0.108654 -0.121953 -0.203901 -0.233947 -0.391762 0.156049 -0.235130 -0.117420 0.169709 -0.376161 0.231105 0.210537 0.232035 0.245361 0.260864 0.275994 0.251648 0.211355 0.231242 0.266808 0.356425 0.345105 0.236778 0.332542 0.344882
chargesum: 0.00000
title: Mulliken charges with hydrogens summed into heavy atoms:
elementType: O O N N N N N C C C C C C C C C C C C
charge: -0.112208 -0.101246 -0.179097 -0.085914 -0.048757 -0.061238 0.067341 0.093000 -0.053934 0.101883 0.138910 0.072093 0.017700 0.050835 0.156049 0.031678 -0.117420 0.169709 -0.139382
polarizability: 2.16262771e+02 3.03917000e+00 1.76668848e+02 -5.42009987e+00 1.07956610e+01 1.07177397e+02
1716.lowfreq: -6.3158 -3.5428 -0.0007 -0.0003 0.0000 10.6368 27.6030 33.3375 49.6100
frequency: 27.5399 33.2600 49.5843 79.5779 94.9063 131.2278 141.3162 160.7878 206.4877 229.5640 247.0054 250.4765 279.9751 304.4033 346.7716 372.9558 399.1866 412.3528 444.4122 502.4256 512.6461 513.7501 527.6321 547.7275 555.4338 567.8109 598.9826 645.9780 666.2706 672.5952 705.9173 747.4716 776.3637 782.9685 793.8613 824.2555 837.2314 855.6143 879.1888 915.3069 925.9723 941.9050 960.7261 967.2766 972.0884 1012.7255 1021.7230 1027.8075 1049.3799 1080.9896 1098.5762 1114.9829 1139.4723 1162.5490 1179.6522 1197.0210 1220.4542 1238.6944 1259.3803 1266.3670 1273.9336 1282.4453 1287.5396 1297.9811 1307.2541 1317.5564 1329.9714 1345.2152 1350.7778 1360.2842 1375.7185 1385.8637 1396.3348 1438.2441 1447.4926 1456.6773 1465.9367 1535.1530 1578.7717 1631.7024 1641.7497 2955.8631 2981.0972 2989.4694 2992.2631 3031.9510 3084.8866 3092.5598 3154.2113 3156.9298 3193.4557 3224.8620 3497.2889 3539.9926 3554.5092 3695.3555
redmass: 6.2297 6.1801 4.6044 5.0700 3.4515 3.9375 4.1762 4.9141 5.1806 4.5454 3.6500 3.4218 5.2032 4.1034 1.2083 4.5365 2.6491 4.3853 3.5109 2.8531 4.9857 1.2538 1.3472 1.0469 2.5097 3.9978 4.8765 4.6511 3.9482 6.1007 4.9221 4.8734 3.0756 1.8060 3.7950 1.8917 3.0033 5.3040 3.0632 3.0162 1.4326 2.7666 2.3777 1.5812 2.4060 3.4166 2.2366 1.9967 3.3380 2.3488 1.8124 1.1664 2.0391 2.2445 1.8303 1.5961 2.3799 1.4363 2.6665 1.5161 1.2884 1.2691 1.3268 5.4701 1.2629 4.3890 1.9463 1.4981 1.5428 1.1960 1.9652 2.6222 1.6040 2.8291 1.0870 3.4171 1.1306 6.0987 1.9043 2.7780 6.7656 1.0831 1.0848 1.0838 1.0622 1.0619 1.1020 1.1036 1.0882 1.0916 1.1055 1.0980 1.0650 1.0442 1.0661 1.1056
irintensity: 1.2645 0.4775 0.6389 6.2427 6.1089 0.2854 0.5591 2.9944 1.1561 7.1643 0.9500 11.4820 3.7122 8.3939 77.6843 5.7531 9.0964 4.4527 7.7188 4.7940 15.3428 219.5821 194.1047 3.3691 61.7605 1.1450 3.3907 46.9386 16.2628 4.5652 13.9778 6.5316 32.6167 39.1201 18.1276 7.1380 14.2212 7.2120 19.8535 32.9702 11.6482 43.5734 9.8285 4.7788 25.3860 19.8641 23.1482 66.2494 40.5078 0.5052 22.1234 6.0073 29.0867 3.0097 39.5408 11.1042 54.4351 24.4102 8.3700 10.1998 3.6965 16.7798 12.9971 48.7276 21.5240 19.1755 69.3920 63.4364 34.6303 13.3800 2.3929 10.6615 20.0360 63.9204 4.9078 17.5484 9.9262 58.9893 27.2653 637.7548 2.5672 2.6919 36.3854 27.2164 37.5387 33.7458 19.7890 27.0382 3.3740 17.1982 9.2169 0.2051 20.9466 129.6125 6.9674 49.4559
temp: 298.150 k
press: 1.00000 atm
elementType: 8 8 7 7 7 7 7 6 6 6 6 6 6 6 6 6 6 6 6 1 1 1 1 1 1 1 1 1 1 1 1 1 1 1
symmnumber: 1
zpe: 706575.9 jmol-1
zpe.correction: 0.269121 hartree
zpe.thermalcorrener: 0.285957 hartree
zpe.thermalcorrenthalpy: 0.286901 hartree
zpe.thermalcorrgfe: 0.223615 hartree
zpe.sumelectzpe: -889.061326 hartree
zpe.sumelectthermal: -889.044490 hartree
zpe.sumelectthermalent: -889.043546 hartree
zpe.sumelectthermalfe: -889.106831 hartree
dipole: 2.0221 -1.5080 -1.7891
dipole: 3.0925
quadrupole: -113.9336 -104.0950 -112.9712
quadrupole: 5.1134 3.6283 2.4195
quadrupole: -3.6003 6.2383 -2.6379 5.1134 3.6283 2.4195
hfenergy: -889.3304467 hartree
pointgroup: C01 [X(C12H15N5O2)]
dipole: 0.7814285 0.6224821 0.6944406 debye
polarizability: 216.0891763|-2.7710553|177.3308225|7.225061|8.237819|106.6890163 unknown
InChI: InChI=1S/C12H15N5O2/c13-11-10-12(15-5-14-11)17(6-16-10)8-2-1-7(3-8)9(19)4-18/h1-2,5-9,18-19H,3-4,13H2
charge 0 multiplicity 1
34 atoms
O  -4.1362 -0.52682 -1.199579
O  -4.153184 -2.471518 0.840464
N  0.900635 1.429312 0.328772
N  3.195306 1.332016 0.510332
N  0.457681 -0.981825 -0.201558
N  2.541912 -2.292843 -0.302068
N  4.672637 -1.342794 0.080827
C  -2.727654 1.020259 0.018521
C  -1.557737 1.271156 1.029595
C  -0.447969 2.060126 0.253424
C  -3.107831 -0.46793 -0.145998
C  -2.214017 1.603774 -1.288055
C  -0.980874 2.152107 -1.171344
C  -3.683247 -1.097477 1.134941
C  1.256902 0.095033 0.079456
C  2.101893 2.113356 0.575285
C  2.676305 0.062969 0.198944
C  3.314933 -1.194864 -0.006873
C  1.186098 -2.125032 -0.377787
H  -3.648164 1.554915 0.33215
H  -0.303639 3.070268 0.685583
H  -1.89611 1.844515 1.908708
H  -1.140673 0.317068 1.391397
H  -2.20138 -1.030274 -0.460466
H  -2.808218 1.539222 -2.20309
H  -0.400571 2.620586 -1.97213
H  -2.94634 -1.1006 1.962191
H  -4.594731 -0.561667 1.449878
H  2.113445 3.179018 0.797559
H  -4.573591 -1.416547 -1.112949
H  -3.364262 -3.060158 0.721063
H  0.614466 -3.028089 -0.614254
H  5.081119 -2.261434 -0.077613
H  5.256159 -0.537028 0.295775
