program: Gaussian 09
title: 000132800
version: EM64L-G09RevD.01
frameworkgroup: C1[X(C6H3N5S)]
method: RPBEPBE
basis: SDD
operation: Freq
keyword: #pfreq=noraman
keyword: PBEPBE/SDD
title: #p freq=noraman PBEPBE/SDD
converged: NO NO NO NO
title: Mulliken charges:
elementType: S N N N N N C C C C C C H H H
charge: 0.405920 -0.179414 0.086226 -0.097728 -0.077663 -0.089046 -0.112322 0.071101 -0.143538 0.057900 -0.203401 -0.536815 0.273123 0.255397 0.290261
chargesum: 0.00000
title: Mulliken charges with hydrogens summed into heavy atoms:
elementType: S N N N N N C C C C C C
charge: 0.405920 -0.179414 0.086226 -0.097728 -0.077663 -0.089046 -0.112322 0.071101 -0.143538 0.331022 0.051996 -0.246554
polarizability: 1.77677965e+02 4.19887980e+00 1.20776139e+02 -1.14201330e-03 -2.39909025e-03 4.31177920e+01
1716.lowfreq: -9.2359 -8.0932 -0.0009 0.0003 0.0023 3.2569 118.0739 139.0392 228.2664
frequency: 118.0529 139.0327 228.2664 260.0280 289.9442 410.0570 452.5991 482.6726 539.0118 553.4928 615.7778 637.8212 638.5885 641.2302 706.2875 719.6958 769.6241 800.9318 819.1846 822.4318 861.9521 893.2540 940.7892 1004.3637 1033.3014 1108.7923 1161.8277 1192.5374 1251.5793 1287.9921 1308.4949 1360.9449 1427.3839 1487.7546 1571.2296 1598.5551 3179.9605 3219.2069 3265.3471
redmass: 6.4393 12.3514 11.5649 5.5030 8.0833 15.6792 8.5393 3.9845 7.2830 6.8631 4.1359 11.5125 9.7939 9.5895 9.7422 1.3664 8.6562 10.7845 5.8904 1.4412 1.3191 13.5803 11.5761 3.5005 12.0791 1.3905 5.2746 3.6735 2.4748 4.6780 3.2629 2.0086 3.9485 9.9598 5.9363 11.0457 1.0936 1.0938 1.1033
irintensity: 0.0725 0.1850 0.1706 0.3481 0.1381 5.7308 0.9714 3.2995 4.4261 3.8777 15.2671 4.4619 4.6132 0.5294 0.5423 69.1720 1.5131 30.1282 17.3041 30.1780 1.7315 9.1478 19.1940 0.4978 1.5542 5.5823 16.6607 17.5939 77.9766 7.7788 30.8397 34.3690 5.0526 1.6202 1.9892 242.6031 0.6133 5.4059 8.1385
temp: 298.150 k
press: 1.00000 atm
elementType: 16 7 7 7 7 7 6 6 6 6 6 6 1 1 1
symmnumber: 1
zpe: 238056.8 jmol-1
zpe.correction: 0.090671 hartree
zpe.thermalcorrener: 0.098926 hartree
zpe.thermalcorrenthalpy: 0.099871 hartree
zpe.thermalcorrgfe: 0.056929 hartree
zpe.sumelectzpe: -901.341705 hartree
zpe.sumelectthermal: -901.333450 hartree
zpe.sumelectthermalent: -901.332505 hartree
zpe.sumelectthermalfe: -901.375447 hartree
dipole: 11.7907 3.3956 -0.0003
dipole: 12.2699
quadrupole: -84.5534 -77.7332 -76.2133
quadrupole: 1.1110 0.0002 0.0010
quadrupole: -5.0534 1.7667 3.2867 1.1110 0.0002 0.0010
hfenergy: -901.4323759 hartree
pointgroup: C01 [X(C6H3N5S1)]
dipole: 4.7648404 0.7743884 -0.0001046 debye
dipolederiv: -0.2926101 0.0353614 0.000002 0.4881645 -0.0587788 -0.0000124 0.0000748 -0.0000181 0.2090821 -0.6100171 0.1271444 0.000004 -0.1022139 -0.5293775 0.0000162 -0.0000195 -0.0000195 0.0874998 -0.2333047 0.1287585 -0.0000548 0.1313202 -0.2138624 -0.0000653 0.0000172 0.0000589 -0.1649939 -0.1071627 0.1127653 -0.0000135 0.1180433 -0.2746879 0.0000074 0.0001112 0.0000108 -0.1825331 -0.4402754 -0.1654534 0.0001108 -0.235597 -0.3804483 -0.000001 0.0003489 0.0000608 -0.1625115 -0.0477236 0.0060687 -0.0001052 0.1871155 0.2402763 -0.0001156 -0.000426 -0.0001097 -0.225476 1.2607498 -0.4173939 -0.0000503 -0.2816153 0.4096827 0.000009 -0.0000638 0.0000254 -0.0086362 -1.0011692 0.2251868 0.0000184 0.522168 -0.0596353 0.0000277 0.0001471 0.0000229 0.1243768 0.6550997 0.1321395 0.0000368 -0.6147583 0.0800184 0.0001396 -0.0001316 -0.0000343 0.1268511 0.2660256 -0.0537785 0.0000105 0.0174665 -0.0613398 -0.0000105 -0.000042 0.00001 -0.061099 0.4166777 -0.3396615 0.000017 -0.1996127 0.4490057 -0.000004 -0.000037 -0.0000057 -0.0717964 -0.0716005 0.2640831 0.0000237 0.0927687 0.1827526 0.0000038 -0.0000023 0.0000129 -0.2746883 0.1205858 0.0324212 -0.0000028 -0.0597966 0.0402135 0.0000017 0.0000054 -0.0000108 0.2175317 0.0109993 -0.0746712 0.0000074 -0.034227 0.0624153 0.0000031 0.0000079 -0.0000005 0.1637253 0.0737254 -0.0129704 -0.000004 -0.0292259 0.1137655 0.0000002 0.0000096 -0.000003 0.2226675 unknown
polarizability: 177.8643827|-2.6435509|120.5897217|-0.0014194|-0.0022461|43.117792 unknown
InChI: InChI=1S/C6H3N5S/c1-2-12-6-4-5(9-10-8-4)7-3-11(1)6/h1-3H
charge 0 multiplicity 1
15 atoms
S  1.870547 -1.889177 -0.000095
N  1.28265 0.694428 -0.000091
N  -0.809558 1.909141 -0.000008
N  -1.662343 -1.62357 0.000104
N  -2.788662 0.415553 -0.000257
N  -2.902813 -0.992479 0.000178
C  0.656932 -0.559677 -0.000069
C  -0.731631 -0.59372 -0.000022
C  -1.444376 0.680975 0.000068
C  2.698421 0.634645 -0.000119
C  0.508927 1.894897 -0.000053
C  3.185763 -0.639558 -0.000034
H  3.270449 1.561569 -0.00013
H  1.085069 2.823216 -0.000097
H  4.223725 -0.961142 0.000026
