program: Gaussian 09
title: 000132797
version: EM64L-G09RevD.01
frameworkgroup: C1[X(C11H12N2)]
method: RPBEPBE
basis: SDD
operation: Freq
keyword: #pfreq=noraman
keyword: PBEPBE/SDD
title: #p freq=noraman PBEPBE/SDD
converged: YES YES NO NO
title: Mulliken charges:
elementType: N N C C C C C C C C C C C H H H H H H H H H H H H
charge: -0.410036 -0.603265 -0.086309 -0.543204 -0.570004 -0.173834 0.358768 0.424018 0.240541 -0.439573 -0.482958 -0.368387 -0.197733 0.213071 0.238325 0.199813 0.201059 0.242036 0.262401 0.301006 0.230481 0.262555 0.262552 0.225080 0.213600
chargesum: 0.00000
title: Mulliken charges with hydrogens summed into heavy atoms:
elementType: N N C C C C C C C C C C C
charge: -0.109030 -0.078158 0.126762 -0.105067 -0.126910 -0.173834 0.358768 0.424018 0.240541 -0.177173 -0.252477 -0.143307 0.015868
polarizability: 1.57777407e+02 -4.40308685e+00 1.56153579e+02 -4.67169026e+00 -6.54970290e-01 6.58785445e+01
1716.lowfreq: -10.9397 -0.0006 0.0003 0.0005 4.6915 6.2208 107.7067 139.8895 204.1730
frequency: 107.7045 139.8782 204.1696 216.8036 253.3751 293.5194 319.3572 381.6801 397.1215 409.6158 481.0067 489.5426 505.7821 540.8835 584.7802 597.0576 614.2569 619.0068 687.7319 738.1828 753.7330 773.5856 785.6354 833.3066 858.3873 860.8268 887.1799 951.8376 984.4610 1020.1383 1036.4298 1041.7696 1077.7760 1099.3341 1108.1514 1133.5226 1175.2874 1189.7264 1225.5510 1230.9053 1234.4014 1270.1868 1283.1984 1303.9652 1344.0913 1366.6557 1366.7546 1405.5206 1418.0286 1446.4684 1456.1713 1464.9986 1503.2588 1568.2384 1618.7577 1628.5761 1639.3265 2875.4959 2966.7203 2969.7769 3018.6690 3024.5685 3118.1835 3133.2237 3153.8273 3218.0554 3438.4849 3564.5035 3614.1962
redmass: 4.0087 2.4960 3.9588 1.2092 2.8664 2.5105 3.7534 3.9460 3.9806 2.8339 2.9087 1.4254 2.4204 4.5746 3.4246 3.9100 1.8119 2.3768 4.2396 3.8283 1.6010 2.3740 1.6222 4.0137 3.3744 1.4936 1.4135 1.3183 1.9621 2.7051 2.3442 2.4125 3.0035 1.9725 2.3664 1.2272 1.2293 1.4895 1.8563 1.2964 1.4053 1.5046 1.7312 1.8468 2.3377 1.5173 1.5126 2.6744 3.5452 1.3938 2.2369 1.1736 3.4901 6.9260 7.4821 6.3884 1.1321 1.0821 1.0592 1.0598 1.1012 1.1012 1.0860 1.0913 1.0984 1.0982 1.0448 1.0970 1.0807
irintensity: 3.5949 0.4049 11.8550 31.0706 5.5243 11.9780 0.5960 4.2698 0.6375 12.9260 15.4527 79.1482 14.3844 1.6249 14.9233 12.3506 120.0277 62.1495 5.7991 6.7143 63.3311 46.4626 6.0637 2.4074 2.6340 0.2216 0.1943 1.8236 0.0193 17.2629 11.6435 9.8333 23.0682 13.3921 3.6898 0.3485 4.1433 2.1636 2.6104 6.1113 1.4068 5.5490 4.1565 5.5010 43.7154 8.2670 6.3271 8.4036 8.1638 0.5604 30.2174 7.9681 2.7717 2.7534 11.5495 11.0249 52.5448 71.2830 33.3472 50.6968 21.6025 45.7282 3.9964 22.2022 36.7595 2.1060 2.3253 0.1373 55.8192
temp: 298.150 k
press: 1.00000 atm
elementType: 7 7 6 6 6 6 6 6 6 6 6 6 6 1 1 1 1 1 1 1 1 1 1 1 1
symmnumber: 1
zpe: 544440.3 jmol-1
zpe.correction: 0.207366 hartree
zpe.thermalcorrener: 0.217634 hartree
zpe.thermalcorrenthalpy: 0.218578 hartree
zpe.thermalcorrgfe: 0.172346 hartree
zpe.sumelectzpe: -534.952342 hartree
zpe.sumelectthermal: -534.942075 hartree
zpe.sumelectthermalent: -534.941131 hartree
zpe.sumelectthermalfe: -534.987363 hartree
dipole: 0.2582 1.6320 -1.3105
dipole: 2.1089
quadrupole: -64.3295 -65.0413 -82.0757
quadrupole: 5.5549 4.4752 0.0844
quadrupole: 6.1526 5.4409 -11.5935 5.5549 4.4752 0.0844
hfenergy: -535.1597087 hartree
pointgroup: C01 [X(C11H12N2)]
dipole: 0.0848356 0.6466164 -0.5129559 debye
dipolederiv: -0.5966802 -0.3231434 0.0127837 0.0737338 -0.4808601 -0.0109684 0.0091793 0.0171771 -0.2886415 -0.7598985 -0.0929476 0.1088893 -0.0912605 -0.1964166 0.0132585 0.1564804 0.0207383 -0.6163798 0.6237314 0.0836798 -0.0828086 0.0605676 0.164676 -0.0118518 0.0524709 0.0067034 0.3711461 0.0858716 -0.081036 -0.0094956 -0.0917035 0.0231185 -0.0595547 0.0483114 -0.0373232 0.1348935 -0.0894624 0.0401563 -0.0095821 0.0873813 0.0772544 0.0491306 0.0839098 0.0688291 0.1047775 -0.2244052 -0.3614798 0.0129748 -0.0661178 -0.0379981 0.0079998 0.0488913 0.0221972 -0.0577599 0.152482 0.0430642 -0.0266981 -0.1617528 -0.1513718 -0.0102361 -0.0762067 -0.0031779 -0.097357 0.3437316 0.0617496 -0.0493088 0.0032768 0.1134011 0.0160531 -0.1102397 -0.0198327 -0.0182996 -0.1193574 0.2410183 0.0009328 -0.0205452 0.5244486 -0.0052487 0.0144206 -0.0233555 0.0577127 0.4906491 0.2547769 -0.0488465 0.0407226 -0.1066197 -0.0030971 -0.0432976 -0.017154 -0.1925097 -0.253166 0.0477706 -0.0058829 0.0760573 0.0329518 -0.0123868 -0.0009087 -0.0109792 -0.2115918 0.0441333 -0.0202076 -0.0152895 -0.0742498 -0.0452589 0.0013055 -0.0157173 -0.0008784 -0.2116496 0.1155761 0.0208893 -0.0220144 0.0629799 -0.0207013 0.0005391 -0.0143035 -0.0008257 -0.1706739 -0.0812377 -0.0120172 0.0930763 -0.0075332 -0.0118781 0.0141819 0.0971968 0.0145494 -0.2377747 -0.0240463 0.0098708 0.0651565 -0.0360146 0.0845188 0.0195994 0.0818551 -0.0357672 -0.1008429 -0.0717737 0.0914441 -0.0466632 0.1157446 -0.0795364 0.0706829 -0.1127802 0.0832157 0.0369552 -0.0010021 -0.0489926 -0.0193668 -0.0787705 -0.1402724 -0.0754472 -0.0803169 -0.102839 0.0449036 -0.0120368 -0.0354141 0.0604354 0.0102022 0.0836356 -0.0047077 0.0448255 0.0407644 -0.0966344 0.0834413 0.0237861 0.0055613 0.024081 -0.0532539 0.0024356 0.0050086 0.0060609 0.2049234 0.1537855 0.0221881 0.0104277 0.0329888 0.1977378 0.0015311 0.0132288 0.0060205 0.3399257 0.0689888 -0.0697642 0.0049696 -0.037506 -0.1312538 0.004595 0.0032907 0.0019298 0.1572583 0.1469044 -0.0042501 -0.0169367 -0.0741574 0.0417975 -0.094217 -0.0905209 -0.1482719 0.2600652 0.1008096 0.027073 -0.0497378 0.0955686 0.0823983 0.0874371 -0.1448974 0.1146241 0.2532019 -0.1250508 -0.0352988 0.0172704 -0.0714115 0.060843 0.0056078 0.0188237 0.0041434 0.1765169 -0.0519877 0.1170842 0.0101534 0.1277183 -0.0313603 -0.006642 0.011296 -0.0065489 0.1578348 unknown
polarizability: 158.1765045|-4.3163759|155.8513618|-3.6182847|-0.6275606|65.7816643 unknown
InChI: InChI=1S/C11H12N2/c12-9-4-7-2-1-3-10-11(7)8(5-9)6-13-10/h1-3,6,9,13H,4-5,12H2
charge 0 multiplicity 1
25 atoms
N  1.700834 1.992002 -0.052771
N  -3.790467 -0.520811 -0.147172
C  -2.357256 -0.266681 -0.407257
C  -1.979086 1.12719 0.190044
C  -1.521889 -1.427673 0.217519
C  0.365876 0.175743 0.055825
C  -0.486812 1.335303 0.087763
C  -0.024487 -1.181006 0.092788
C  1.727038 0.59019 -0.033589
C  0.357723 2.440028 0.013519
C  1.00479 -2.139705 0.029322
C  2.764263 -0.371696 -0.08492
C  2.374453 -1.73085 -0.053604
H  -2.107317 -0.232665 -1.496831
H  -2.31549 1.133673 1.246767
H  -2.54686 1.922112 -0.333384
H  -1.806027 -2.387786 -0.258141
H  -1.813764 -1.502363 1.2854
H  0.130729 3.504869 0.002399
H  2.513035 2.600964 -0.117003
H  0.76736 -3.210234 0.046201
H  -4.110431 -1.444103 -0.459738
H  -4.409663 0.225451 -0.482462
H  3.822295 -0.095017 -0.150173
H  3.152352 -2.502238 -0.0965
