program: Gaussian 09
title: 000132832
version: EM64L-G09RevD.01
frameworkgroup: C1[X(C26H27NO3)]
method: RPBEPBE
basis: SDD
operation: Freq
keyword: #p
keyword: freq=noraman
keyword: PBEPBE/SDD
title: #p freq=noraman PBEPBE/SDD
converged: YES YES NO NO
title: Mulliken charges:
elementType: O O O N C C C C C C C C C C C C C C C C C C C C C C C C C C H H H H H H H H H H H H H H H H H H H H H H H H H H H
charge: -0.217454 -0.263652 -0.265582 -0.271819 -0.256363 -0.300718 -0.409437 0.089319 0.562138 -0.372414 0.394631 -0.570495 -0.420570 -0.386085 -0.355007 -0.343862 0.506401 -0.357943 -0.363940 0.313691 -0.348953 -0.365038 0.322923 -0.423102 -0.406374 -0.227343 -0.230630 -0.243641 -0.537864 -0.537674 0.263711 0.243283 0.205073 0.221519 0.212473 0.215825 0.208623 0.207291 0.230466 0.249230 0.290034 0.243263 0.251842 0.242242 0.251881 0.240116 0.230274 0.231558 0.222744 0.223270 0.227156 0.246660 0.222234 0.222782 0.244695 0.219342 0.219269
chargesum: 0.00000
title: Mulliken charges with hydrogens summed into heavy atoms:
elementType: O O O N C C C C C C C C C C C C C C C C C C C C C C C C C C
charge: -0.217454 -0.263652 -0.265582 -0.271819 0.007348 -0.057435 0.017155 0.089319 0.562138 0.055884 0.394631 -0.154580 -0.190104 -0.136856 -0.064973 -0.100599 0.506401 -0.106101 -0.121698 0.313691 -0.097072 -0.124922 0.322923 -0.192828 -0.174816 -0.004598 -0.007360 -0.016485 0.153811 0.145632
polarizability: 3.70068391e+02 3.03560954e+01 2.86681315e+02 -1.32905632e+01 2.81970966e+01 2.58083671e+02
1716.lowfreq: -5.5946 -0.0007 -0.0001 0.0007 2.0280 5.5732 8.6688 14.5339 16.3345
frequency: 7.9564 14.5299 16.3016 22.2241 24.4825 40.0232 43.8919 63.1867 65.8502 84.7664 91.9682 100.3292 123.6367 126.6429 140.5768 172.4827 175.4083 199.9344 209.6765 224.7785 231.4734 239.8817 269.3811 281.8916 303.1781 320.9596 336.6217 343.9836 372.5542 397.1038 403.2636 412.1865 414.1511 417.8850 464.4427 482.8028 504.9119 521.5006 525.8212 542.1171 568.3814 584.0018 612.2992 617.5451 627.3417 631.2707 700.0937 706.2340 720.7058 725.3552 742.2395 752.2836 758.6456 770.7619 786.3035 803.1508 807.9876 811.3622 819.7942 836.9043 844.0739 851.8743 857.6547 914.5156 918.5140 925.9561 940.3596 949.9297 963.1135 974.8895 975.6460 987.1644 987.8618 989.8783 993.0551 999.9146 1002.0240 1025.3044 1033.6414 1037.0543 1048.9637 1057.8646 1087.2669 1108.2346 1109.5007 1112.5719 1113.5037 1114.7430 1122.3790 1135.9540 1157.3260 1157.6259 1170.2407 1171.6417 1176.9961 1180.2577 1186.5055 1216.5770 1217.8265 1225.2182 1227.6793 1235.3168 1247.4361 1259.4203 1285.4434 1292.6081 1299.0983 1309.3619 1323.2501 1326.6987 1331.3326 1348.3853 1370.3074 1382.0651 1383.2004 1391.9035 1422.2209 1432.3416 1437.3354 1438.0316 1440.1219 1464.9210 1466.6278 1467.7834 1470.9088 1472.8172 1473.7596 1483.1849 1487.4583 1502.9175 1506.3376 1579.7215 1584.1886 1592.6252 1614.1811 1624.0420 1628.0746 1693.8104 2955.3418 2960.8004 2967.5588 2972.2307 2981.3096 2991.3867 3008.3531 3021.9756 3033.6819 3041.3076 3049.1850 3050.9781 3113.4810 3113.7262 3118.6786 3122.6973 3126.0862 3130.8512 3132.0700 3142.4096 3145.0563 3157.5169 3161.6202 3164.0620 3166.6782 3167.9678 3176.9452
redmass: 4.8241 4.1075 5.2642 3.6582 5.1904 3.7683 3.9874 5.4823 4.5060 4.1049 4.6758 3.1876 2.8215 3.6010 4.1878 3.7490 3.6986 3.4722 3.3869 4.1135 1.2882 1.5496 2.9727 4.0785 4.5717 3.9745 2.4325 4.3738 4.6922 5.2507 2.8201 3.0070 3.2506 4.5583 4.0955 3.9948 3.3072 3.6202 2.4958 3.6332 4.7569 4.0689 5.1438 6.3518 7.1097 6.3709 5.5573 1.7732 3.7705 2.6913 1.5492 3.0770 2.1051 4.3301 4.1658 1.4864 1.9443 3.6185 1.2985 1.6278 1.5169 1.3759 2.2705 1.6258 2.0471 1.3698 4.8761 1.4410 1.3564 1.3875 1.3203 8.6826 8.3448 6.2410 1.3185 2.8856 2.6660 2.3302 3.6829 1.9155 3.3938 2.9746 1.6652 1.9391 1.9254 1.2612 1.2602 1.4117 1.3002 1.5218 1.3333 1.3268 1.4772 1.0657 1.2448 1.2484 1.1164 2.0432 2.0531 2.2753 2.2039 2.7561 1.5055 1.3682 1.1212 1.4481 1.4062 1.3230 1.5635 1.3572 1.4936 1.6496 4.7374 7.6276 4.6133 3.7801 3.0872 3.4980 1.1994 1.1736 2.1721 1.0784 1.0501 1.0496 1.1127 1.0753 1.0784 2.2607 1.1012 2.5071 2.6857 7.5106 7.0051 6.0386 6.1849 6.3507 6.3372 12.0675 1.0331 1.0330 1.0602 1.0598 1.0597 1.0857 1.0967 1.0939 1.0950 1.1037 1.1040 1.1037 1.0877 1.0862 1.0897 1.0990 1.0992 1.0906 1.0891 1.0957 1.0875 1.0888 1.1014 1.0940 1.0954 1.0950 1.0976
irintensity: 0.0838 0.1327 0.2884 0.7448 0.3174 1.6550 0.4982 0.2147 0.3813 2.3219 4.0660 1.9256 0.8925 4.7592 4.1925 1.2999 0.4475 2.1648 7.7888 0.9782 0.0166 1.1540 0.7787 1.4595 0.6283 1.8214 0.2953 3.3333 1.4012 3.5293 0.0104 0.8170 0.8705 3.7241 0.3306 3.9183 19.2209 12.5068 17.4426 29.8736 3.9639 13.3585 3.6612 0.0337 0.9869 1.2552 9.4544 55.5853 0.1806 0.5885 6.4519 1.5041 37.2106 11.4985 21.1374 16.4384 16.2528 2.6489 3.3991 47.5032 68.5473 2.0042 6.6929 5.8141 1.5002 1.2541 11.3606 0.2201 0.0477 0.0466 0.9134 46.5315 42.2914 0.0742 0.1244 7.3978 9.3233 5.4494 1.2824 7.8888 5.2833 17.6311 29.0730 30.7136 47.7932 0.1594 0.0767 26.6285 23.3040 10.2430 1.1568 0.6889 15.0626 1.0646 82.6568 55.2933 0.2496 3.0889 6.8176 179.1196 110.6721 148.0645 32.7985 2.4322 1.1169 23.6528 5.4620 0.9199 15.9452 7.6069 21.8349 14.0809 50.1133 0.6663 8.1949 37.4814 7.4499 1.7259 31.1674 7.5183 6.3338 2.1237 13.1021 13.2242 2.1784 54.5308 77.5417 21.8507 16.6876 133.0022 313.3604 11.0602 16.4319 1.4742 12.1248 63.8554 12.8168 463.9199 75.7050 65.9927 3.7382 3.0513 81.6472 30.4314 1.2507 6.0259 5.3532 50.8426 42.3887 75.8348 6.7098 11.9158 16.9809 30.0592 27.9663 10.3406 5.5537 45.3238 14.3829 3.7644 25.1700 11.6520 9.7665 4.2503 3.4257
temp: 298.150 k
press: 1.00000 atm
elementType: 8 8 8 7 6 6 6 6 6 6 6 6 6 6 6 6 6 6 6 6 6 6 6 6 6 6 6 6 6 6 1 1 1 1 1 1 1 1 1 1 1 1 1 1 1 1 1 1 1 1 1 1 1 1 1 1 1
symmnumber: 1
zpe: 1217989.3 jmol-1
zpe.correction: 0.463908 hartree
zpe.thermalcorrener: 0.492117 hartree
zpe.thermalcorrenthalpy: 0.493061 hartree
zpe.thermalcorrgfe: 0.399127 hartree
zpe.sumelectzpe: -1285.208880 hartree
zpe.sumelectthermal: -1285.180671 hartree
zpe.sumelectthermalent: -1285.179727 hartree
zpe.sumelectthermalfe: -1285.273661 hartree
dipole: 0.0050 4.4468 2.5321
dipole: 5.1172
quadrupole: -167.9678 -175.4707 -169.3754
quadrupole: -13.0908 -12.3232 -14.6269
quadrupole: 2.9701 -4.5328 1.5626 -13.0908 -12.3232 -14.6269
hfenergy: -1285.672788 hartree
pointgroup: C01 [X(C26H27N1O3)]
dipole: 0.0214434 -1.7407093 1.0112711 debye
polarizability: 369.0640984|31.7874609|287.1266069|13.7461947|-28.1563263|258.6426709 unknown
InChI: InChI=1S/C26H27NO3/c1-29-22-15-11-20(12-16-22)25-24(10-6-9-19-7-4-3-5-8-19)26(28)27(25)21-13-17-23(30-2)18-14-21/h3-5,7-8,11-18,24-25H,6,9-10H2,1-2H3
charge 0 multiplicity 1
57 atoms
O  1.153304 2.640451 -2.622879
O  0.508502 -5.320176 0.042243
O  6.843673 1.670786 1.114886
N  1.520265 1.175275 -0.715406
C  -0.510908 1.087633 -1.360999
C  0.325885 0.429349 -0.18054
C  -1.690175 1.99638 -0.981294
C  0.808967 1.803866 -1.756883
C  0.42974 -1.081351 -0.139445
C  -2.927818 1.207462 -0.497712
C  2.847117 1.274878 -0.235193
C  -4.112705 2.13847 -0.118566
C  -0.220304 -1.810909 0.890542
C  1.132945 -1.802154 -1.133368
C  3.785238 2.114999 -0.9023
C  3.253067 0.549971 0.911012
C  -5.334237 1.36259 0.352549
C  -0.181445 -3.2160 0.922928
C  1.188708 -3.212581 -1.114523
C  0.524572 -3.923303 -0.082689
C  5.0991 2.217896 -0.420077
C  4.575729 0.654717 1.395362
C  5.503893 1.490294 0.728313
C  -5.555826 1.117982 1.73247
C  -6.257187 0.825763 -0.582898
C  -6.6644 0.356274 2.167535
C  -7.36702 0.063774 -0.154174
C  -7.574212 -0.17533 1.224584
C  1.222744 -6.100644 -0.971665
C  7.308049 0.935797 2.292026
H  -0.820706 0.334476 -2.108614
H  0.014905 0.821186 0.807996
H  -1.36818 2.711345 -0.196317
H  -1.960047 2.607802 -1.865712
H  -2.663349 0.58239 0.378868
H  -3.255902 0.50499 -1.2899
H  -4.369063 2.756576 -1.001943
H  -3.776756 2.836602 0.673228
H  -0.766239 -1.27228 1.67556
H  1.659673 -1.255282 -1.924307
H  3.46916 2.678112 -1.784953
H  2.543975 -0.108146 1.423423
H  -0.682205 -3.785751 1.711428
H  1.748346 -3.739054 -1.893171
H  5.831636 2.859694 -0.918741
H  4.863036 0.081869 2.281917
H  -4.857712 1.533113 2.470656
H  -6.106818 1.012334 -1.654028
H  -6.821318 0.18196 3.238321
H  -8.071056 -0.338871 -0.891535
H  -8.435942 -0.763605 1.559545
H  1.075715 -7.150911 -0.680515
H  2.304272 -5.862603 -0.97568
H  0.801165 -5.931038 -1.981537
H  8.365302 1.216176 2.408331
H  6.743573 1.227288 3.199759
H  7.227072 -0.159029 2.142486
