program: Gaussian 09
title: 000011864
version: EM64L-G09RevD.01
frameworkgroup: C1[X(C4H9NO3)]
method: RPBEPBE
basis: SDD
operation: Freq
keyword: #pfreq=noraman
keyword: PBEPBE/SDD
title: #p freq=noraman PBEPBE/SDD
converged: YES YES NO NO
title: Mulliken charges:
elementType: O O O N C C C C H H H H H H H H H
charge: -0.411477 -0.203007 -0.213493 0.150861 -0.094782 -0.379099 -0.335932 -0.681179 0.245531 0.228617 0.232595 0.201429 0.251492 0.217831 0.214749 0.235757 0.340106
chargesum: 0.00000
title: Mulliken charges with hydrogens summed into heavy atoms:
elementType: O O O N C C C C
charge: -0.071372 -0.203007 -0.213493 0.150861 0.150749 0.082114 0.116989 -0.012842
polarizability: 6.65513268e+01 -2.13960030e+00 5.55676646e+01 -2.85572730e+00 -7.34558747e-01 6.35972162e+01
1716.lowfreq: -8.1614 -0.0013 -0.0012 -0.0012 14.2247 19.5342 40.8342 70.4634 102.6465
frequency: 40.7633 70.3943 102.6077 173.4599 205.2032 219.4354 274.5701 323.5105 335.7531 440.3707 492.8428 639.9663 671.8455 774.8597 797.2429 908.1504 948.7574 974.2223 1025.6605 1061.4265 1096.0383 1122.0744 1181.9547 1227.4266 1253.0517 1273.8709 1311.3382 1338.1858 1347.6714 1373.5997 1400.3228 1437.5925 1458.1338 1475.8803 1482.0500 1486.7003 2985.8777 2989.5324 3003.7494 3041.8954 3058.9257 3085.6917 3089.3404 3098.3778 3563.0418
redmass: 7.2680 2.2075 3.1349 3.6835 1.7029 2.1997 1.6210 3.5653 1.5180 5.0507 3.9083 3.2335 8.7853 1.3570 4.0465 1.6855 2.4326 2.1539 2.9881 2.4657 1.3252 2.4536 1.6863 2.5334 1.8223 1.2895 1.2272 1.4585 1.3213 1.2541 1.2008 3.6661 1.0970 1.0741 1.0542 1.0560 1.0419 1.0602 1.0608 1.0880 1.0993 1.1000 1.1002 1.0976 1.0664
irintensity: 0.8852 2.3325 0.5759 5.7176 0.9434 8.4927 27.0882 10.5302 120.0341 13.0983 9.4848 2.0807 4.0993 10.0802 21.6689 1.5118 54.2580 48.0824 17.0946 2.4983 16.0539 9.6283 24.5964 41.7189 30.1632 18.4868 9.7163 10.3824 2.8661 25.3697 12.3964 120.5370 1.8780 10.8447 14.4553 15.7793 7.3480 67.2545 12.7369 4.7541 0.8819 35.1138 43.0411 11.0212 9.5718
temp: 298.150 k
press: 1.00000 atm
elementType: 8 8 8 7 6 6 6 6 1 1 1 1 1 1 1 1 1
symmnumber: 1
zpe: 356866.2 jmol-1
zpe.correction: 0.135923 hartree
zpe.thermalcorrener: 0.145353 hartree
zpe.thermalcorrenthalpy: 0.146297 hartree
zpe.thermalcorrgfe: 0.100726 hartree
zpe.sumelectzpe: -437.491247 hartree
zpe.sumelectthermal: -437.481817 hartree
zpe.sumelectthermalent: -437.480873 hartree
zpe.sumelectthermalfe: -437.526444 hartree
dipole: -5.2400 1.4385 -1.4258
dipole: 5.6178
quadrupole: -53.3219 -50.2924 -48.3846
quadrupole: 1.8192 -1.0536 -3.1753
quadrupole: -2.6556 0.3739 2.2817 1.8192 -1.0536 -3.1753
hfenergy: -437.6271701 hartree
pointgroup: C01 [X(C4H9N1O3)]
dipole: 2.0731798 0.5156358 0.5666207 debye
dipolederiv: -0.5145199 0.2001742 0.191666 0.1345864 -0.8041809 -0.0151613 0.2399483 -0.0539 -0.2084079 -0.5030185 -0.18301 0.2258232 -0.1975237 -0.2741002 0.115935 0.0945763 0.021711 -0.6794017 -0.4505247 -0.1450716 -0.1192701 -0.1403692 -0.30207 -0.1223206 0.0533077 -0.0110395 -0.7408629 0.7463693 0.4831656 -0.0948963 0.4520713 0.2666137 0.0329703 -0.126048 0.0286841 1.166258 -0.0200759 -0.0669167 0.0368725 -0.0278901 -0.0073942 -0.0268813 0.0247371 0.076447 0.105251 0.1247175 -0.0433888 -0.0100743 -0.0703202 0.0172856 -0.0319576 -0.0738649 -0.0500997 0.0980633 0.3792393 -0.2074452 -0.1314002 -0.1429559 0.6198706 0.0852619 -0.1793832 0.0536502 0.2378641 -0.070909 -0.0186772 -0.0171706 0.0522332 0.0614796 -0.0243704 0.0334039 -0.0229002 0.0876794 0.0295381 -0.0400778 0.0086174 -0.0223454 0.0315359 -0.0159384 -0.0112969 -0.0339423 -0.0789113 0.0241165 -0.0228985 0.0137869 -0.0023409 -0.1256683 0.0441004 0.0184989 0.0720978 0.0627664 0.0294519 0.0067691 -0.0477762 0.0042127 0.0951869 0.0142235 -0.0047755 -0.021553 -0.1051295 -0.1754948 -0.0478983 0.0336534 -0.1031365 -0.0218914 -0.0152407 0.0027994 -0.0152223 0.07977 0.0751382 0.0295096 -0.0283774 0.0340771 0.072028 -0.0671234 0.0151533 -0.0183455 -0.0450217 0.0797355 -0.0139636 0.0309039 -0.0272599 0.0909137 -0.0111305 -0.041348 -0.0152805 -0.1589498 0.0921442 -0.0302906 -0.0134611 -0.078192 -0.1342938 0.0712927 -0.0011082 0.0844392 0.0529033 -0.0921302 0.0882594 0.0393253 0.1155353 0.0109783 -0.0465658 0.0481288 -0.0524931 0.0828305 0.2462223 0.0117603 -0.1182223 0.0196175 0.4037064 0.0129061 -0.0927291 -0.0422533 0.0432988 unknown
polarizability: 66.6507643|1.9018181|55.4670788|-2.8235069|0.7563923|63.5983645 unknown
InChI: InChI=1S/C4H9NO3/c1-2-4(3-6)5(7)8/h4,6H,2-3H2,1H3
charge 0 multiplicity 1
17 atoms
O  -0.914288 2.237803 0.135413
O  -1.69127 -1.073302 1.084421
O  -1.300201 -0.997215 -1.163506
N  -1.000114 -0.72763 0.0576
C  0.301691 0.054593 0.304013
C  1.492714 -0.790771 -0.211715
C  0.183132 1.427504 -0.389123
C  2.855692 -0.256554 0.281807
H  0.344924 0.165035 1.402894
H  1.363062 -1.831192 0.141285
H  1.459139 -0.821999 -1.316259
H  1.157393 1.949478 -0.301448
H  -0.055526 1.279568 -1.454694
H  2.898038 -0.223588 1.386313
H  3.071861 0.757306 -0.099599
H  3.668332 -0.919316 -0.063814
H  -0.746281 2.461079 1.085913
