program: Gaussian 09
title: 000132799
version: EM64L-G09RevD.01
frameworkgroup: C1[X(C14H9Cl2N2O5P)]
method: RPBEPBE
basis: SDD
operation: Freq
keyword: #p
keyword: freq=noraman
keyword: PBEPBE/SDD
title: #p freq=noraman PBEPBE/SDD
converged: YES YES NO NO
title: Mulliken charges:
elementType: Cl Cl P O O O O O N N C C C C C C C C C C C C C C H H H H H H H H H
charge: -0.028378 -0.044247 1.355121 -0.633185 -0.219736 -0.633664 -0.657550 -0.566462 -0.454433 -0.044897 0.050684 0.399313 0.140780 0.059477 0.326398 -0.049104 -0.238691 -0.390720 -0.286904 -0.340202 -0.175673 -0.144059 -0.140978 -0.211305 0.407920 0.333873 0.254863 0.301000 0.281172 0.259373 0.266805 0.410101 0.413306
chargesum: 0.00000
title: Mulliken charges with hydrogens summed into heavy atoms:
elementType: Cl Cl P O O O O O N N C C C C C C C C C C C C C C
charge: -0.028378 -0.044247 1.355121 -0.633185 -0.219736 -0.223562 -0.244244 -0.566462 -0.046513 -0.044897 0.050684 0.399313 0.140780 0.059477 0.326398 -0.049104 0.095182 -0.135856 0.014097 -0.059030 0.083701 -0.144059 -0.140978 0.055500
polarizability: 3.72930934e+02 1.98175883e+01 2.67012398e+02 5.92422545e+00 -1.87376039e+01 9.95635577e+01
1716.lowfreq: -4.0498 -1.5804 0.0014 0.0016 0.0019 4.0901 17.0835 24.2826 28.5478
frequency: 16.8198 24.2809 28.4231 46.7014 50.1616 57.7749 78.7131 99.0269 118.2387 144.1857 155.9091 165.6877 178.7667 200.0803 205.9041 214.8194 259.5047 277.3721 306.8424 314.7623 322.0592 333.7663 352.2341 367.4715 370.8888 385.9900 409.0907 431.3355 460.9181 481.8614 512.1541 531.0873 536.9037 547.6562 610.3594 621.9774 627.6078 655.9817 676.8201 684.5974 685.7995 725.2765 747.0169 756.4249 782.8558 788.1480 808.6600 826.4065 837.1537 846.2981 866.3440 929.6490 932.3291 943.9733 955.6202 964.4046 1003.6602 1015.7251 1020.8052 1061.3482 1077.7057 1084.5456 1105.2155 1124.5313 1149.6012 1173.5857 1198.3966 1238.8179 1256.9044 1279.5277 1293.3378 1372.1454 1377.3513 1401.5190 1403.3702 1454.7048 1463.0366 1480.0221 1540.8990 1568.4324 1582.7249 1600.9050 1601.7758 1616.5653 3141.2609 3146.0735 3162.5580 3171.8420 3174.2825 3178.0340 3408.0650 3593.2825 3603.0520
redmass: 4.3113 10.7032 3.1956 4.8921 10.8745 4.2373 13.0629 6.4588 7.7081 6.8588 9.6691 11.6686 6.2266 8.9287 7.9028 7.1185 2.9827 7.4244 4.8779 1.5190 7.9219 7.0034 5.9158 8.7952 6.5965 10.0865 6.4319 3.6071 3.9362 6.5696 8.0722 4.2816 9.3520 4.0879 8.7173 7.3474 7.8001 9.0272 6.0576 7.5922 6.7371 8.5950 4.6237 6.8346 7.8561 3.6330 1.4541 1.4071 3.1836 1.7624 6.6498 7.0388 1.4040 1.3768 1.3532 1.3509 1.4724 6.8019 1.4225 1.9279 2.1023 3.0042 4.5380 2.0060 1.5035 2.7790 2.9808 1.5823 1.3876 2.4178 2.1740 3.9158 8.7335 6.9539 5.2201 3.0042 3.3662 3.4090 3.6138 8.3576 9.1900 7.4360 5.5267 7.4234 1.0904 1.0913 1.0927 1.0929 1.0960 1.0963 1.0804 1.0666 1.0668
irintensity: 3.2637 0.3238 13.9547 6.4050 0.9151 14.5018 1.7092 0.5554 6.0697 0.0520 1.4596 4.5249 1.6669 14.2274 18.2569 21.8031 49.6562 10.5662 14.4311 149.4397 37.9366 3.4785 1.6236 17.0337 33.7911 22.4057 11.1213 0.7132 4.5030 6.4407 2.2717 45.1961 3.7894 1.7793 20.6580 3.4293 14.6224 12.6326 1.6763 29.6320 37.2382 137.4739 1.2389 217.8001 127.9351 5.9320 2.5218 43.0213 88.7598 219.7776 14.5003 15.8878 8.8620 2.7012 5.5652 12.4518 8.4605 28.1798 13.3475 14.4772 77.7072 223.6466 82.4685 48.0785 8.6039 57.3146 42.4633 39.3263 44.6862 85.4886 7.7504 4.7362 0.4030 27.4819 34.3686 11.0682 403.4861 36.4916 567.9431 111.7024 3.5773 6.9714 111.9514 30.8640 2.8292 0.5436 18.4174 2.4113 5.4361 0.3343 328.4419 111.1452 104.3708
temp: 298.150 k
press: 1.00000 atm
elementType: 17 17 15 8 8 8 8 8 7 7 6 6 6 6 6 6 6 6 6 6 6 6 6 6 1 1 1 1 1 1 1 1 1
symmnumber: 1
zpe: 552595.2 jmol-1
zpe.correction: 0.210472 hartree
zpe.thermalcorrener: 0.232967 hartree
zpe.thermalcorrenthalpy: 0.233911 hartree
zpe.thermalcorrgfe: 0.155446 hartree
zpe.sumelectzpe: -2284.187366 hartree
zpe.sumelectthermal: -2284.164871 hartree
zpe.sumelectthermalent: -2284.163927 hartree
zpe.sumelectthermalfe: -2284.242393 hartree
dipole: -4.1342 9.9499 -0.1016
dipole: 10.7750
quadrupole: -166.5674 -159.6221 -157.2724
quadrupole: 7.3630 -8.7095 6.4527
quadrupole: -5.4134 1.5319 3.8816 7.3630 -8.7095 6.4527
hfenergy: -2284.3978381 hartree
pointgroup: C01 [X(C14H9Cl2N2O5P1)]
dipole: -2.0046934 -3.7337172 0.1078849 debye
polarizability: 367.8917512|-30.0904063|271.377729|-9.070215|-20.3803002|100.2374101 unknown
InChI: InChI=1S/C14H9Cl2N2O5P/c15-7-1-3-11-9(5-7)14(19)18-13(17-11)10-6-8(16)2-4-12(10)23-24(20,21)22/h1-6,17,20-21H
charge 0 multiplicity 1
33 atoms
Cl -4.278548 3.965066 -0.076109
Cl 6.602719 -0.687867 -0.070831
P  -2.430649 -2.945155 -0.11875
O  -1.773551 -1.488826 0.526389
O  2.654913 3.102401 -0.547043
O  -2.290746 -2.601241 -1.789659
O  -1.04452 -3.866347 0.270387
O  -3.832633 -3.496186 0.376369
N  0.604762 -0.342553 0.284646
N  0.614325 2.002408 -0.21152
C  -0.030136 0.870121 0.06344
C  1.998211 -0.449588 0.204736
C  -1.523699 0.91504 0.149179
C  2.745148 0.728927 -0.086527
C  -2.381178 -0.201555 0.348005
C  2.033577 2.029296 -0.299117
C  -2.135985 2.191288 0.023377
C  2.653615 -1.692818 0.405008
C  4.157224 0.655957 -0.171661
C  -3.781202 -0.067716 0.439757
C  4.054221 -1.755921 0.318421
C  -3.528846 2.319235 0.095384
C  4.787278 -0.57713 0.032128
C  -4.369416 1.205851 0.304455
H  0.018935 -1.161494 0.497003
H  -1.468761 3.043802 -0.136372
H  2.071228 -2.595923 0.618029
H  4.710689 1.572746 -0.394943
H  -4.408813 -0.945698 0.628072
H  4.57841 -2.704156 0.468172
H  -5.453981 1.326674 0.371528
H  -3.014586 -2.970626 -2.357384
H  -1.237407 -4.779111 0.604132
