program: Gaussian 09
title: 000135788
version: EM64L-G09RevD.01
frameworkgroup: C1[X(C19H25N3O2)]
method: RPBEPBE
basis: SDD
operation: Freq
keyword: #p
keyword: freq=noraman
keyword: PBEPBE/SDD
title: #p freq=noraman PBEPBE/SDD
converged: YES YES NO NO
title: Mulliken charges:
elementType: O O N N N C C C C C C C C C C C C C C C C C C C H H H H H H H H H H H H H H H H H H H H H H H H H
charge: -0.289397 -0.274703 -0.125610 -0.078787 -0.146421 -0.391125 -0.392573 -0.344545 -0.344958 -0.480626 -0.360508 0.255371 -0.449013 -0.516761 -0.436648 0.191063 -0.183592 -0.339545 0.493542 -0.396709 -0.401867 -0.233656 -0.236139 -0.242971 0.259360 0.226313 0.232980 0.231686 0.234973 0.190365 0.179468 0.215466 0.233136 0.279238 0.209473 0.269458 0.244769 0.222673 0.251042 0.237712 0.194392 0.213789 0.240489 0.222860 0.226025 0.227661 0.225839 0.226950 0.230057
chargesum: 0.00000
title: Mulliken charges with hydrogens summed into heavy atoms:
elementType: O O N N N C C C C C C C C C C C C C C C C C C C
charge: -0.289397 -0.274703 -0.125610 -0.078787 -0.146421 0.094548 0.072092 0.080793 0.049976 0.031749 0.118423 0.255371 0.018430 -0.028006 -0.028467 0.191063 0.056897 -0.116685 0.493542 -0.170684 -0.174206 -0.007817 -0.009189 -0.012914
polarizability: 3.45632750e+02 -3.19492735e+01 1.89384682e+02 8.12315262e+00 1.20998494e+01 1.89837401e+02
1716.lowfreq: -4.4688 -2.0148 -0.0008 -0.0007 0.0004 6.9983 15.2464 19.5601 22.1741
frequency: 7.9506 18.7259 22.0712 31.7885 43.3815 56.6993 74.0770 86.9751 98.0584 122.1589 135.4686 150.0305 161.1354 193.0576 230.4481 243.4217 254.0024 276.6950 290.8622 299.8190 320.0143 347.8949 372.3112 400.6262 403.4565 425.2744 462.4542 483.9581 492.4467 520.8844 543.4008 553.1714 569.5476 606.6710 616.4954 617.2467 639.0107 657.5467 696.6254 736.7040 746.2339 770.5381 790.7486 817.8678 836.9615 845.8016 850.7569 859.4865 891.8441 909.3775 922.3936 926.1204 936.1454 953.1737 976.9566 985.9148 988.2035 995.1642 998.6423 999.7154 1027.5515 1036.9664 1041.5191 1051.6231 1057.1018 1076.6846 1078.4138 1087.5416 1104.6372 1132.1168 1142.1854 1157.7546 1172.5366 1179.1159 1190.6882 1192.5939 1196.7320 1201.9670 1213.5706 1221.4316 1228.6645 1235.7410 1266.5168 1277.3650 1282.6897 1286.6078 1291.5929 1297.5454 1304.1027 1319.4735 1328.1397 1332.0318 1340.6314 1345.4244 1356.3368 1360.9817 1382.0725 1391.0317 1414.1483 1417.4654 1440.5860 1446.3223 1453.7500 1454.7377 1461.9377 1464.1653 1467.9981 1473.8999 1474.8833 1485.8677 1489.5580 1584.8910 1592.3675 1612.5298 1636.6842 1667.2323 2839.9325 2851.0842 2863.3208 2948.9313 2952.4863 2978.2551 2978.9974 2986.3161 3007.7846 3019.8236 3028.2129 3030.1560 3049.4942 3072.5588 3074.1542 3085.7924 3094.6200 3100.5928 3100.8837 3107.6014 3116.9830 3125.7657 3138.4990 3148.8718 3165.3050
redmass: 4.7523 4.9283 4.6461 4.8065 4.2658 5.7174 3.5562 3.8146 6.2900 4.1043 3.3084 2.2343 2.6378 2.5545 3.1695 3.3226 2.9321 2.7693 2.7571 3.0481 3.0914 4.7513 2.8428 2.1494 2.7772 4.0111 2.8174 3.1183 3.9389 3.7766 2.8291 3.0698 3.7688 3.4594 6.3175 3.5263 2.9228 4.7374 1.7701 3.0402 2.1198 2.2337 3.7446 2.8471 1.5713 1.4423 2.1584 1.7809 1.5323 2.8122 1.5468 2.2551 2.5027 2.3151 1.3869 1.1908 5.5288 2.3488 1.8967 1.3967 2.1382 2.0015 2.4926 1.7692 3.1569 1.9270 1.8061 2.2437 2.3928 2.5207 3.1138 1.2853 1.0668 1.7137 1.1291 1.3168 1.1936 1.7416 1.3890 1.7878 1.4126 2.1550 1.5210 1.3329 1.3508 1.7430 1.3899 1.8000 1.5797 1.4286 1.3165 1.3218 1.3421 1.4328 1.4731 1.3233 2.6420 2.2621 2.2368 2.3565 2.2563 1.2010 1.0909 1.0989 1.0776 1.0813 1.1073 1.1028 1.0954 2.3112 1.1095 5.7978 7.6119 6.0065 9.9113 6.1562 1.0704 1.0707 1.0690 1.0656 1.0648 1.0840 1.0722 1.0668 1.0656 1.0976 1.0622 1.0887 1.0892 1.0942 1.0901 1.0984 1.0955 1.1034 1.0934 1.0893 1.0871 1.0858 1.0911 1.0960 1.1015
irintensity: 0.5768 0.4154 0.2762 2.1590 0.1703 2.4942 4.8245 0.5933 1.5040 3.1671 1.9818 3.0625 1.7100 2.7030 6.2620 2.9832 1.5925 1.1527 19.5529 9.8053 5.1256 9.2353 1.7758 0.9911 0.0461 0.2323 2.9254 5.0745 14.8850 0.1744 3.7833 1.6868 14.3105 4.7728 0.0963 2.4182 12.6763 6.8279 40.9013 8.4120 35.6806 34.9357 3.0837 0.7089 0.5403 0.1463 12.9125 1.8785 4.9363 9.4107 1.1131 7.8537 3.9660 8.6163 0.6217 56.1473 0.4630 98.9085 20.0618 6.2244 2.4698 14.3876 20.7969 1.4335 7.2760 7.4451 1.5932 7.3777 0.9538 96.3523 9.9212 9.6060 0.3653 5.8359 0.1864 13.3798 21.8012 55.4485 130.7071 3.2304 130.3152 5.9583 9.4669 2.7368 24.5045 98.7563 11.2628 14.5187 23.6089 4.1527 21.8385 4.4133 14.7231 1.8560 9.7932 3.8593 1.0076 16.5464 62.7968 92.2199 8.8573 71.1505 1.9613 3.7673 10.7790 1.0934 31.7011 3.8388 10.1631 17.7825 3.4839 2.1351 328.1294 5.7423 299.4120 1.1791 52.2199 48.7476 156.8213 51.3052 92.0010 41.5382 11.0665 42.8058 21.8607 14.5752 31.5086 45.9840 26.0048 11.5539 18.2159 11.7003 6.8963 28.1840 28.5868 20.2383 12.6929 0.9444 10.7118 43.6360 26.4080
temp: 298.150 k
press: 1.00000 atm
elementType: 8 8 7 7 7 6 6 6 6 6 6 6 6 6 6 6 6 6 6 6 6 6 6 6 1 1 1 1 1 1 1 1 1 1 1 1 1 1 1 1 1 1 1 1 1 1 1 1 1
symmnumber: 1
zpe: 1078790.8 jmol-1
zpe.correction: 0.410890 hartree
zpe.thermalcorrener: 0.433566 hartree
zpe.thermalcorrenthalpy: 0.434511 hartree
zpe.thermalcorrgfe: 0.354315 hartree
zpe.sumelectzpe: -1051.923398 hartree
zpe.sumelectthermal: -1051.900722 hartree
zpe.sumelectthermalent: -1051.899778 hartree
zpe.sumelectthermalfe: -1051.979973 hartree
dipole: 3.0390 0.5213 -4.1041
dipole: 5.1333
quadrupole: -144.7608 -144.9351 -139.5425
quadrupole: 4.4539 21.8765 -1.2656
quadrupole: -1.6813 -1.8556 3.5370 4.4539 21.8765 -1.2656
hfenergy: -1052.3342881 hartree
pointgroup: C01 [X(C19H25N3O2)]
dipole: 1.2161912 -0.6045985 1.4946995 debye
polarizability: 345.7442826|32.770216|183.4187419|-2.0379247|10.0045587|195.6918075 unknown
InChI: InChI=1S/C19H25N3O2/c23-18-9-5-11-22(18)16-19(24)21-14-12-20(13-15-21)10-4-8-17-6-2-1-3-7-17/h1-4,6-8H,5,9-16H2
charge 0 multiplicity 1
49 atoms
O  -3.093468 1.572832 0.114445
O  -6.389704 -0.754818 -1.598306
N  -1.716229 -0.254226 -0.310732
N  0.942702 -1.311602 -0.030519
N  -5.392078 0.026434 0.388732
C  -0.538082 0.611994 -0.545878
C  -1.45517 -1.689994 -0.542214
C  0.665515 0.115352 0.272843
C  -0.234474 -2.152786 0.281862
C  -4.131224 -0.663264 0.185913
C  -5.710171 0.853464 1.570682
C  -2.945099 0.316747 -0.01081
C  -6.97586 1.639073 1.117325
C  -7.603311 0.760739 0.003989
C  2.191568 -1.810145 0.603144
C  -6.430018 -0.070879 -0.53404
C  3.42211 -1.158323 0.014496
C  4.412566 -0.583739 0.754358
C  5.658754 0.035709 0.257343
C  6.004858 0.094363 -1.123896
C  6.56273 0.606496 1.197553
C  7.204253 0.70349 -1.542456
C  7.765257 1.215815 0.780023
C  8.092313 1.268157 -0.594083
H  -0.818889 1.640498 -0.267938
H  -0.2813 0.589266 -1.623791
H  -1.239022 -1.851816 -1.617849
H  -2.334259 -2.294258 -0.272409
H  1.557946 0.711884 0.013424
H  0.458012 0.266669 1.363265
H  -0.497602 -2.116444 1.371461
H  -0.003492 -3.203016 0.022483
H  -3.912778 -1.340726 1.038025
H  -4.270943 -1.286597 -0.719767
H  -5.917858 0.206727 2.449767
H  -4.865971 1.522189 1.802827
H  -6.666401 2.611234 0.697047
H  -7.664385 1.829438 1.957002
H  -8.061179 1.338468 -0.814698
H  -8.374735 0.068711 0.392788
H  2.187136 -1.675473 1.715292
H  2.231734 -2.903053 0.412239
H  3.475963 -1.189187 -1.082621
H  4.288081 -0.56978 1.848772
H  5.334299 -0.339771 -1.873805
H  6.314223 0.570164 2.265909
H  7.452107 0.738985 -2.609464
H  8.444589 1.64837 1.523059
H  9.024482 1.740032 -0.923692
