program: Gaussian 09
title: 000135699
version: EM64L-G09RevD.01
frameworkgroup: C1[X(C7H10N6)]
method: RPBEPBE
basis: SDD
operation: Freq
keyword: #pfreq=noraman
keyword: PBEPBE/SDD
title: #p freq=noraman PBEPBE/SDD
converged: NO NO NO NO
title: Mulliken charges:
elementType: N N N N N N C C C C C C C H H H H H H H H H H
charge: -0.391488 -0.401034 -0.115485 -0.043203 -0.023593 -0.595391 0.066052 0.237764 -0.065262 -0.295479 -0.233489 -0.048431 -0.724018 0.291477 0.233795 0.234793 0.295700 0.258623 0.218823 0.217903 0.234371 0.328563 0.319009
chargesum: 0.00000
title: Mulliken charges with hydrogens summed into heavy atoms:
elementType: N N N N N N C C C C C C C
charge: -0.100011 -0.105334 -0.115485 -0.043203 -0.023593 0.052181 0.066052 0.237764 -0.065262 0.173110 0.025134 -0.048431 -0.052921
polarizability: 1.54276667e+02 4.78110696e+00 1.51536131e+02 -1.21410239e-01 2.42023673e-02 5.75304259e+01
1716.lowfreq: -14.6352 -3.5974 0.0007 0.0007 0.0009 5.9134 52.4595 80.7320 110.4227
frequency: 51.5078 80.3982 110.4196 119.5043 195.1772 213.9759 260.8703 270.7309 281.0992 325.3194 351.0767 357.9164 401.0758 486.6762 514.9643 521.2518 530.3360 604.7038 610.6498 661.3039 716.2083 717.0102 775.9704 779.8547 797.4504 814.1437 897.4977 901.6165 986.1383 1021.1457 1063.5647 1080.0206 1119.0327 1146.3523 1153.5938 1205.1908 1255.6351 1266.9345 1306.3578 1326.5353 1343.7125 1365.9347 1396.9511 1419.0065 1429.2428 1462.3610 1478.3349 1481.9402 1486.4348 1501.2662 1548.7204 1593.1589 1619.6952 2976.3358 2986.2351 3025.6591 3068.8544 3093.1794 3231.2692 3566.9613 3581.0943 3589.2793 3729.0813
redmass: 2.3414 2.9481 3.7648 3.3075 3.3048 2.9760 1.3630 1.5763 3.7489 3.2097 3.5463 6.2357 1.1963 5.6040 1.1362 1.2741 8.6389 2.6960 5.3454 6.0991 11.4756 5.3543 5.9577 8.5451 1.0996 1.6165 2.3123 6.1018 2.8545 3.5423 2.7338 1.9222 3.0299 1.5194 3.0725 2.3450 1.1001 2.5230 8.5872 1.9420 2.2368 2.2680 1.2469 6.3127 2.2955 2.2203 1.0407 1.1172 2.6102 1.0941 9.2895 1.7276 4.1515 1.0380 1.0586 1.1035 1.1012 1.0976 1.0983 1.0438 1.0778 1.0815 1.1060
irintensity: 2.3327 0.0242 0.3174 12.1273 0.2936 26.2308 1.9613 43.3394 1.4249 0.0158 18.2557 8.4721 298.6475 1.1196 8.8928 169.8757 0.4611 0.5978 0.8009 3.0429 4.6961 1.7708 4.7659 1.4729 4.3155 32.1451 2.4327 3.3506 2.4261 6.2030 0.3458 19.1115 10.5316 1.9931 33.8961 10.4842 0.1267 34.2681 88.3283 7.1418 40.9213 65.0462 38.9256 34.6546 37.3434 82.3274 13.2806 31.3732 80.6817 40.2064 541.7181 322.1809 455.5991 32.0718 28.7401 8.5992 58.8534 30.5333 2.3283 103.8881 24.8629 39.3688 42.6494
temp: 298.150 k
press: 1.00000 atm
elementType: 7 7 7 7 7 7 6 6 6 6 6 6 6 1 1 1 1 1 1 1 1 1 1
symmnumber: 1
zpe: 474043.7 jmol-1
zpe.correction: 0.180554 hartree
zpe.thermalcorrener: 0.192571 hartree
zpe.thermalcorrenthalpy: 0.193515 hartree
zpe.thermalcorrgfe: 0.142366 hartree
zpe.sumelectzpe: -600.318096 hartree
zpe.sumelectthermal: -600.306079 hartree
zpe.sumelectthermalent: -600.305135 hartree
zpe.sumelectthermalfe: -600.356284 hartree
dipole: 6.1004 -3.4100 -0.0118
dipole: 6.9888
quadrupole: -84.8705 -51.4042 -79.6911
quadrupole: 0.1065 -0.0035 0.0392
quadrupole: -12.8819 20.5844 -7.7025 0.1065 -0.0035 0.0392
hfenergy: -600.4986499 hartree
pointgroup: C01 [X(C7H10N6)]
dipole: 2.4149156 -1.3147127 -0.003714 debye
dipolederiv: -1.6367913 0.2463025 0.0016619 0.5065541 -0.3859691 0.0024966 -0.0047509 0.0033058 -0.494902 -0.4525823 0.1751027 0.0003274 0.1197469 -0.5325262 -0.0003215 0.0003285 -0.0003669 -0.2351747 -0.7400064 0.4226737 0.0006741 0.3774674 -1.0997317 -0.0007603 0.0011848 -0.0010439 -0.2482491 -0.3393424 -0.1679408 -0.0000422 0.1590841 -0.6797839 -0.0002891 0.0000648 0.0000237 -0.279757 -0.5466488 -0.5093156 0.0001498 0.1618673 -1.1584877 -0.000512 0.0002315 0.0000361 -0.2551644 -0.1572256 0.0199865 -0.0007682 0.0300582 -1.6871147 -0.0004531 -0.0007928 -0.0003173 -0.7409603 -0.9875235 0.0637679 0.0010286 -0.1532238 0.1268409 0.0002303 0.0011311 -0.0000616 -0.0025233 1.929963 -0.3076581 -0.0023008 -0.4536549 0.8747757 0.0001743 -0.003168 0.0005551 0.2202591 0.4411858 0.2782106 -0.0002718 -0.1460485 1.0864071 0.0004813 -0.0003383 0.0001331 0.0754807 0.7286087 0.0860043 -0.0022664 0.3077292 0.2350041 -0.0029141 0.0000958 -0.0033416 0.314191 0.5769964 -0.2745429 -0.0008054 -0.3970543 0.2585481 0.000513 -0.0008228 0.0003485 -0.0713535 0.6117706 0.0401575 -0.0003528 -0.1609925 2.1887369 0.0011291 -0.0002342 0.0011261 0.1677432 -0.1158073 0.0372069 -0.0012402 -0.01376 0.0472207 0.0017343 -0.0005591 0.0021859 0.1023757 0.1536322 -0.0381526 0.000399 -0.1026262 0.0809928 -0.0010326 0.0023011 -0.0021368 0.3081854 -0.0433247 0.0225744 -0.0156511 -0.0899175 -0.0068007 0.0935423 0.0413963 0.0977588 -0.0684651 -0.0377589 0.0238557 0.0170478 -0.0871133 -0.0086347 -0.0929246 -0.0379174 -0.0963485 -0.0623154 0.1184406 0.0416713 0.0003056 0.0155259 0.1858014 -0.0000331 0.0002501 -0.0000612 0.3545686 0.0952708 -0.0396429 0.0000873 -0.0443743 -0.020852 -0.0000103 0.0000894 0.0000124 0.1835498 0.1026239 -0.0139464 0.0297851 0.0631376 -0.0153995 0.1183025 -0.017154 0.1272935 -0.0818761 0.1016899 -0.0134752 -0.028271 0.0650372 -0.0207371 -0.1194585 0.0174742 -0.1292049 -0.0778175 -0.120358 -0.0739779 -0.0000781 -0.1308044 0.024419 0.0001982 0.0006122 0.0002872 0.1144383 0.1636157 -0.0585105 0.0002794 -0.0335124 0.252071 -0.0000184 0.0002597 -0.0000564 0.3925432 0.1535715 0.0396489 0.000302 0.0068743 0.2552196 -0.0000742 0.0003179 -0.0001271 0.3852236 unknown
polarizability: 154.1695694|4.8105155|151.6433034|-0.0891682|0.017528|57.5303512 unknown
InChI: InChI=1S/C7H10N6/c1-2-9-5-4-6(11-3-10-4)13-7(8)12-5/h3,9-10H,2,8H2,1H3
charge 0 multiplicity 1
23 atoms
N  1.986551 -0.651817 -0.004016
N  -0.831746 -2.198962 -0.001188
N  0.640491 1.277823 -0.001607
N  -2.810216 -1.041687 0.001407
N  -1.83142 1.234022 0.001348
N  -0.62804 3.238808 0.000915
C  -0.485628 -0.834288 -0.001116
C  0.726563 -0.081185 -0.00224
C  -1.735493 -0.129941 0.000575
C  3.21859 0.150709 -0.00533
C  -2.230565 -2.252994 0.00036
C  -0.615746 1.859254 0.000327
C  4.45462 -0.766944 0.010876
H  2.071239 -1.6672 -0.008326
H  3.232097 0.806291 -0.897567
H  3.220519 0.823171 0.873952
H  -0.206256 -3.002637 -0.001985
H  -2.771371 -3.197414 0.000693
H  4.473333 -1.404343 0.915655
H  4.483905 -1.422511 -0.880657
H  5.374982 -0.158424 0.009822
H  -1.524559 3.716529 0.002361
H  0.252151 3.744439 0.00004
