program: Gaussian 09
title: 000135694
version: EM64L-G09RevD.01
frameworkgroup: C1[X(C20H11NO2)]
method: RPBEPBE
basis: SDD
operation: Freq
keyword: #p
keyword: freq=noraman
keyword: PBEPBE/SDD
title: #p freq=noraman PBEPBE/SDD
converged: YES YES NO NO
title: Mulliken charges:
elementType: O O N C C C C C C C C C C C C C C C C C C C C H H H H H H H H H H H
charge: -0.229119 -0.222524 0.014246 0.238653 -0.407319 0.210666 0.617329 0.307022 0.457543 0.221491 -0.576009 -0.727986 0.249239 0.415850 -0.500391 -0.447590 -0.394148 -0.486238 -0.213617 -0.305792 -0.439593 -0.285373 -0.237863 0.276957 0.255144 0.247724 0.248975 0.298437 0.242434 0.234463 0.219348 0.244717 0.236721 0.236606
chargesum: 0.00000
title: Mulliken charges with hydrogens summed into heavy atoms:
elementType: O O N C C C C C C C C C C C C C C C C C C C C
charge: -0.229119 -0.222524 0.014246 0.238653 -0.407319 0.210666 0.617329 0.307022 0.457543 0.221491 -0.299052 -0.472842 0.249239 0.415850 -0.252667 -0.198615 -0.095712 -0.243804 0.020846 -0.086444 -0.194876 -0.048652 -0.001257
polarizability: 4.42004439e+02 -1.87343351e+01 3.08878846e+02 4.83448948e-01 2.02400310e-01 8.30606045e+01
1716.lowfreq: -28.7237 -8.5941 -8.4380 0.0002 0.0004 0.0008 2.3790 57.6365 75.0348
frequency: -28.6387 57.6356 75.0344 106.2431 115.2481 144.6130 199.4844 202.0372 229.2390 262.9452 269.4198 320.3274 320.6529 366.1929 391.4926 410.7865 420.1491 463.8768 504.6518 515.6377 528.9428 543.2660 552.3613 588.1966 608.5405 613.7204 630.0697 639.2746 663.3623 686.0688 710.2343 718.1275 749.2819 750.2847 758.5093 775.6882 808.1809 808.8879 834.3116 843.2435 872.4005 896.3665 901.5422 926.9443 942.8725 951.9718 960.6782 976.9077 987.8098 996.0160 997.9432 1033.1745 1046.9290 1063.6250 1100.2546 1133.8122 1154.8432 1178.7353 1181.4102 1193.7300 1209.3062 1231.8546 1237.7002 1267.5497 1288.5765 1301.2460 1318.8542 1335.9604 1358.0406 1383.0249 1392.2869 1404.4873 1422.2549 1437.8492 1449.7781 1468.0303 1472.2967 1482.4355 1503.6824 1549.8813 1573.4635 1605.1772 1618.2111 1623.7140 1637.7278 3124.0199 3126.9113 3127.6971 3134.6807 3143.7135 3149.8431 3157.8132 3164.9873 3180.8600 3231.9711 3250.8259
redmass: 4.5119 6.4414 8.3777 6.5925 9.0970 4.4401 6.5846 4.3794 3.9141 7.0762 4.1057 5.4935 6.8639 9.1203 3.6111 6.3427 3.3242 6.5857 3.4686 6.4620 6.0506 3.0871 3.1381 6.5440 6.2256 4.7207 7.1665 3.1454 7.3349 7.5977 2.9391 6.3612 5.9894 1.4637 5.8855 1.6453 3.7984 1.9356 1.8882 2.2192 1.8010 5.8900 1.8892 1.6170 7.2512 1.4620 1.5141 4.9994 1.4094 1.3835 1.4166 2.4667 2.4262 2.8736 3.0108 1.7908 1.4636 1.3559 1.1404 1.3181 1.6911 2.4982 2.2794 2.0755 2.1106 2.2862 4.8302 8.6574 4.9610 3.4295 4.5655 2.5647 2.5108 3.7017 3.4606 5.1498 3.1387 7.3553 3.9757 6.1920 6.9869 7.4587 6.2482 7.3988 7.3558 1.0878 1.0895 1.0881 1.0877 1.0910 1.0988 1.0946 1.0989 1.0960 1.0949 1.0903
irintensity: 0.4654 0.1849 0.5414 0.1105 1.6590 0.2860 2.0814 0.7858 9.7099 1.2859 0.0208 2.4730 0.0887 0.2160 0.2498 2.7274 5.8181 4.8134 0.7540 1.6643 3.2440 11.4326 0.3867 1.3453 17.4475 0.1843 7.0848 0.1755 6.8436 10.0202 0.4150 0.8948 6.8105 16.2195 0.9080 100.5435 4.7256 24.8150 2.4928 0.4493 22.1942 2.5937 0.2294 47.1916 7.8429 1.4538 15.3068 13.3705 0.9595 2.9404 0.9018 8.0713 10.5389 37.0178 39.4307 33.0950 0.2208 96.7687 4.3027 19.4725 135.1227 112.2803 149.9494 111.0423 7.3178 54.2516 55.4428 44.0050 39.9782 39.7137 5.4337 30.1543 4.4176 18.5522 40.4343 93.0311 45.6102 35.2351 42.5043 6.9753 53.8294 0.2256 13.4749 23.9551 3.4004 0.1740 8.6830 1.9142 2.8155 8.0299 34.3939 29.2320 36.5482 5.3101 5.2790 1.5398
temp: 298.150 k
press: 1.00000 atm
elementType: 8 8 7 6 6 6 6 6 6 6 6 6 6 6 6 6 6 6 6 6 6 6 6 1 1 1 1 1 1 1 1 1 1 1
symmnumber: 1
zpe: 658250.6 jmol-1
zpe.correction: 0.250714 hartree
zpe.thermalcorrener: 0.265888 hartree
zpe.thermalcorrenthalpy: 0.266832 hartree
zpe.thermalcorrgfe: 0.208689 hartree
zpe.sumelectzpe: -972.356319 hartree
zpe.sumelectthermal: -972.341146 hartree
zpe.sumelectthermalent: -972.340202 hartree
zpe.sumelectthermalfe: -972.398345 hartree
dipole: -5.4220 -5.5986 0.0275
dipole: 7.7938
quadrupole: -124.6705 -124.1823 -137.2412
quadrupole: -22.1241 0.1627 0.2126
quadrupole: 4.0275 4.5157 -8.5432 -22.1241 0.1627 0.2126
hfenergy: -972.6070334 hartree
pointgroup: C01 [X(C20H11N1O2)]
dipole: 2.0504676 2.2798477 0.0136518 debye
polarizability: 443.2047773|-13.7757226|307.6790447|-0.3488757|-0.0256184|83.0600676 unknown
InChI: InChI=1S/C20H11NO2/c22-21(23)18-11-17-19-14(9-8-12-4-1-2-6-15(12)19)10-13-5-3-7-16(18)20(13)17/h1-11H
charge 0 multiplicity 1
34 atoms
O  -4.441322 -2.287741 -0.012186
O  -2.656142 -3.723533 -0.025186
N  -3.16214 -2.52831 -0.01644
C  -0.296048 -0.159781 -0.002126
C  -1.422482 0.730606 0.003338
C  1.028523 0.396028 0.000006
C  -1.353679 2.144202 0.007346
C  -2.66182 0.013523 0.00145
C  1.107555 1.865258 -0.003053
C  2.290338 -0.358782 0.004305
C  -0.87546 -1.508891 -0.011264
C  -0.045176 2.695365 0.001997
C  -2.268871 -1.398613 -0.008327
C  3.549472 0.353623 -0.009742
C  2.401135 2.519944 -0.013292
C  -2.600423 2.866587 0.012637
C  -3.866211 0.726416 0.006833
C  3.571814 1.799475 -0.019937
C  -3.813486 2.164439 0.012876
C  2.35371 -1.788243 0.025255
C  4.782173 -0.365587 -0.010152
C  3.573653 -2.477519 0.02593
C  4.803723 -1.764827 0.006179
H  -0.379206 -2.475423 -0.023692
H  0.09403 3.783645 0.000745
H  2.420659 3.615541 -0.017177
H  -2.59552 3.96251 0.015884
H  -4.825413 0.202128 0.005964
H  4.543215 2.30625 -0.03014
H  -4.757143 2.720094 0.016976
H  1.440226 -2.377135 0.046007
H  5.720074 0.20183 -0.022207
H  3.576116 -3.572348 0.042871
H  5.755025 -2.307034 0.006123
