program: Gaussian 09
title: 000135723
version: EM64L-G09RevD.01
frameworkgroup: C1[X(C16H16F2N4O2S)]
method: RPBEPBE
basis: SDD
operation: Freq
keyword: #p
keyword: freq=noraman
keyword: PBEPBE/SDD
title: #p freq=noraman PBEPBE/SDD
converged: YES YES NO NO
title: Mulliken charges:
elementType: S F F O O N N N N C C C C C C C C C C C C C C C C H H H H H H H H H H H H H H H H
charge: 0.428339 -0.209639 -0.192134 -0.218686 -0.214629 -0.193269 -0.169871 -0.298035 -0.728060 -0.355086 -0.337438 0.153135 -0.407548 -0.410165 0.165719 0.262130 0.076726 0.245381 -0.406972 0.279967 -0.639237 -0.374466 0.102186 0.217624 -0.659447 0.236451 0.223569 0.229173 0.231721 0.204191 0.213739 0.222311 0.190311 0.274520 0.310565 0.222792 0.261518 0.251713 0.234359 0.225479 0.351061
chargesum: 0.00000
title: Mulliken charges with hydrogens summed into heavy atoms:
elementType: S F F O O N N N N C C C C C C C C C C C C C C C C
charge: 0.428339 -0.209639 -0.192134 -0.218686 -0.214629 -0.193269 -0.169871 -0.023516 -0.376999 0.104934 0.123456 0.153135 0.010382 0.002457 0.165719 0.262130 0.076726 0.245381 -0.406972 0.279967 -0.328672 0.109844 0.102186 0.217624 0.052104
polarizability: 3.85832633e+02 -9.09487875e+00 2.53781580e+02 -3.46600553e+00 7.09589593e+00 1.20042092e+02
1716.lowfreq: -5.7318 -0.0012 0.0003 0.0008 2.3471 7.3760 17.7673 29.0269 45.4344
frequency: 17.5229 28.9722 45.3778 51.5383 73.2022 85.5690 108.5448 120.7890 153.9780 170.0964 184.3568 191.2346 202.8078 215.0009 227.6086 244.9278 255.8280 264.0353 293.1171 299.2386 319.3027 343.0132 373.9266 380.3059 390.1963 398.1963 406.4608 411.6771 440.4770 447.0938 471.4735 476.9449 507.5716 516.7150 523.8374 528.4465 576.1848 590.0017 618.7380 640.4567 659.9534 660.6906 686.7644 718.9672 749.3129 753.6912 785.5457 797.0723 819.4029 840.5207 853.4918 873.2287 913.5958 921.7266 948.5146 955.9709 965.3449 1019.2063 1047.7146 1050.2317 1058.7080 1084.1469 1089.2606 1103.0179 1129.8186 1143.4773 1163.3333 1168.8594 1199.1945 1213.0775 1217.1056 1241.2371 1245.6034 1261.4826 1269.9168 1290.4022 1321.3281 1322.8344 1333.7391 1340.7017 1351.4261 1365.2925 1374.7235 1383.2438 1392.0955 1401.4738 1445.1242 1452.5116 1455.4678 1459.3013 1462.9270 1469.0957 1469.8178 1480.0112 1495.3680 1504.0665 1534.4055 1548.6115 1584.2369 1624.2395 1642.2891 2872.2426 2887.1375 2963.3275 2982.2259 2994.6412 2997.5228 3041.9326 3045.7430 3088.5072 3106.9000 3109.1784 3114.1990 3126.7049 3162.0331 3476.1888 3580.3564
redmass: 4.6712 4.2180 6.8436 6.2937 9.9245 4.2055 3.0763 7.3357 9.7153 11.3131 4.5788 9.4019 1.0634 4.6404 6.0499 4.6445 4.0617 6.5494 3.9487 4.4415 6.5590 6.3306 3.0009 1.8377 4.2204 3.5891 3.2595 2.6426 5.8540 2.8883 4.5720 5.0510 5.2233 5.2570 11.5075 2.2192 6.0495 7.3119 9.5822 4.2443 2.2503 2.7965 11.5651 8.1240 5.1295 5.2227 1.6860 8.0694 2.3840 1.5315 4.5659 3.4397 2.6738 1.4156 3.6128 6.8471 3.1642 3.2439 2.1707 2.1193 2.4714 2.2634 2.0031 2.2636 1.9876 2.6307 5.3454 3.5208 1.1725 1.6995 3.6642 1.8945 1.8333 1.4375 1.5718 1.6709 1.9555 1.2658 1.5295 1.2826 1.7411 2.5705 3.2480 1.5259 1.2119 4.4737 1.3547 1.1962 1.3541 1.1645 1.9681 1.1110 1.0977 1.0625 6.3193 1.1446 7.5732 9.2367 10.0000 9.2534 9.8951 1.0703 1.0695 1.0699 1.0670 1.0646 1.0438 1.0897 1.0918 1.0992 1.0961 1.0967 1.0927 1.0953 1.0919 1.0757 1.0801
irintensity: 0.0901 0.4193 1.2988 0.1357 0.0039 2.4983 0.1151 1.6819 2.6061 1.3513 2.3348 4.6844 0.0548 2.4393 1.9725 1.9293 6.7685 4.1668 0.2853 7.7199 1.5012 2.9814 34.3737 64.2482 5.5205 22.0802 36.8269 13.2760 18.8981 6.0819 8.6971 37.5038 33.9460 2.6785 20.0643 53.0400 5.5573 16.4978 3.3300 27.8207 49.4627 22.2066 1.4486 0.5554 6.3636 36.3760 3.3936 17.0393 5.4706 0.5570 0.7190 7.2181 14.7764 19.6035 32.4146 40.5970 26.6042 66.1059 17.8954 28.5594 14.2367 33.7302 21.3926 16.4029 5.7227 44.8474 19.1808 10.5222 22.4951 22.1315 12.7229 34.5643 5.9189 4.6763 54.2429 80.9746 130.5659 50.6862 7.3556 12.2377 25.0253 2.6288 20.4032 11.5104 25.3411 268.3419 30.3836 78.3656 216.0500 33.4385 159.5609 5.9299 5.0189 0.7887 223.3756 42.0555 124.3626 10.7088 195.0458 458.0221 245.9893 83.6428 78.1351 67.5240 63.6567 23.4528 16.5186 54.3276 65.1731 15.8101 15.1599 17.5393 10.1298 10.5235 10.5384 0.1285 102.3759
temp: 298.150 k
press: 1.00000 atm
elementType: 16 9 9 8 8 7 7 7 7 6 6 6 6 6 6 6 6 6 6 6 6 6 6 6 6 1 1 1 1 1 1 1 1 1 1 1 1 1 1 1 1
symmnumber: 1
zpe: 803038.3 jmol-1
zpe.correction: 0.305861 hartree
zpe.thermalcorrener: 0.328470 hartree
zpe.thermalcorrenthalpy: 0.329414 hartree
zpe.thermalcorrgfe: 0.253374 hartree
zpe.sumelectzpe: -1584.654820 hartree
zpe.sumelectthermal: -1584.632211 hartree
zpe.sumelectthermalent: -1584.631267 hartree
zpe.sumelectthermalfe: -1584.707307 hartree
dipole: 5.6777 -9.6176 0.0869
dipole: 11.1688
quadrupole: -148.8425 -161.5241 -149.8492
quadrupole: 24.0877 7.2270 1.3544
quadrupole: 4.5628 -8.1188 3.5561 24.0877 7.2270 1.3544
hfenergy: -1584.960681 hartree
pointgroup: C01 [X(C16H16F2N4O2S1)]
dipole: -2.3971408 -3.6826993 0.0070917 debye
polarizability: 386.1875707|3.1809298|253.2274868|-8.000384|-7.1053525|120.2412469 unknown
InChI: InChI=1S/C16H16F2N4O2S/c1-2-22-12-8(14(23)10-15(24)20-25-16(10)22)7-9(17)13(11(12)18)21-5-3-19-4-6-21/h7,19-20H,2-6H2,1H3
charge 0 multiplicity 1
41 atoms
S  4.075389 -2.166412 0.005329
F  -1.441866 -1.748956 0.114013
F  -2.310215 3.011754 0.187488
O  2.70167 2.773912 -0.172856
O  5.50415 1.492915 -0.315066
N  -3.287451 0.317709 0.272739
N  1.442304 -1.239558 0.160242
N  -5.890272 -0.747815 -0.14582
N  5.259281 -0.81622 -0.164158
C  -3.848472 -0.68884 1.207062
C  -4.321708 1.140424 -0.401638
C  -1.927215 0.60368 0.196557
C  -4.856379 -1.599983 0.478747
C  -5.323639 0.207379 -1.119396
C  0.46874 -0.196087 0.129116
C  0.906674 1.167189 0.018237
C  -0.934104 -0.419437 0.173203
C  -1.401163 1.934166 0.113091
C  2.769205 -0.877596 0.026752
C  3.264116 0.415309 -0.090877
C  -0.049421 2.212338 0.005543
C  1.110618 -2.691302 0.31029
C  2.345675 1.556037 -0.086525
C  4.739393 0.498533 -0.203992
C  0.858436 -3.399138 -1.035012
H  -4.382465 -0.150699 2.018667
H  -3.039888 -1.284845 1.653058
H  -3.845289 1.809801 -1.133501
H  -4.867885 1.757959 0.339234
H  -4.295616 -2.222955 -0.259961
H  -5.337403 -2.273225 1.211466
H  -6.139864 0.821145 -1.542402
H  -4.790072 -0.295741 -1.964041
H  -6.686088 -1.279768 -0.516029
H  0.322849 3.240335 -0.050177
H  1.960957 -3.159842 0.842986
H  0.239713 -2.785117 0.972111
H  -0.030516 -2.983444 -1.535742
H  1.726608 -3.302736 -1.709825
H  0.680127 -4.475199 -0.857882
H  6.260688 -1.014069 -0.208032
