program: Gaussian 09
title: 000135688
version: EM64L-G09RevD.01
frameworkgroup: C1[X(C20H11NO2)]
method: RPBEPBE
basis: SDD
operation: Freq
keyword: #p
keyword: freq=noraman
keyword: PBEPBE/SDD
title: #p freq=noraman PBEPBE/SDD
converged: NO YES YES YES
title: Mulliken charges:
elementType: O O N C C C C C C C C C C C C C C C C C C C C H H H H H H H H H H H
charge: -0.231400 -0.222356 0.013015 -0.408201 0.144682 0.410891 0.313814 0.681269 0.310822 -0.713201 0.131098 -0.593735 0.275045 -0.464505 0.424749 -0.468971 -0.383281 -0.477099 -0.209592 -0.330291 -0.433935 -0.256673 -0.247969 0.238341 0.288920 0.250102 0.249913 0.295875 0.242039 0.231322 0.221715 0.247976 0.233367 0.236255
chargesum: 0.00000
title: Mulliken charges with hydrogens summed into heavy atoms:
elementType: O O N C C C C C C C C C C C C C C C C C C C C
charge: -0.231400 -0.222356 0.013015 -0.408201 0.144682 0.410891 0.313814 0.681269 0.310822 -0.474860 0.131098 -0.304815 0.275045 -0.214403 0.424749 -0.219058 -0.087406 -0.235059 0.021729 -0.108576 -0.185959 -0.023306 -0.011714
polarizability: 4.98578634e+02 1.42622134e+01 2.76458372e+02 -1.44732923e-02 1.02480651e-02 8.31187882e+01
1716.lowfreq: -6.4568 -4.8768 -0.0003 0.0007 0.0010 2.7257 41.9636 60.4081 74.8550
frequency: 41.9589 60.4081 74.8545 112.5927 113.5575 142.8663 188.5601 204.3464 243.6857 245.7445 283.5854 294.0903 327.2056 376.7007 391.7500 415.2338 423.4127 456.4585 503.6748 511.7273 531.4057 558.7881 560.6612 572.7990 603.4056 610.6982 631.9683 644.3453 659.8791 691.8366 712.9662 713.0319 742.7937 757.6232 760.8511 772.9909 813.0497 822.4745 849.0809 861.4128 861.6701 889.6860 901.3074 911.7495 927.2035 953.5312 960.3057 989.4492 993.7880 994.9676 998.5288 1031.1192 1042.4481 1066.5451 1099.4729 1123.7215 1161.1137 1178.7918 1181.5195 1207.3292 1225.9409 1233.5730 1239.2010 1255.2117 1275.7462 1304.9970 1325.4209 1346.6866 1350.5153 1378.0852 1397.6231 1407.5003 1424.4453 1441.1343 1456.7379 1466.2405 1470.5317 1477.4748 1507.1701 1551.7350 1580.6277 1613.7317 1618.3460 1623.8832 1628.7129 3127.6636 3129.5527 3132.2341 3136.4136 3146.7821 3155.2794 3156.5261 3156.8486 3169.5509 3180.4520 3218.5651
redmass: 6.4641 5.7288 8.0927 8.5323 6.6066 4.1431 6.0648 4.3482 4.1839 8.8725 4.3807 4.1595 7.0211 6.9541 4.3112 8.1248 3.2311 5.4762 6.7654 3.2309 3.7680 2.6849 6.6750 6.6760 5.7683 4.6179 3.6661 6.4030 8.7616 7.7014 6.0248 2.8500 7.0009 7.0308 1.3339 1.5766 1.7314 2.5648 5.0723 1.7802 4.2344 1.6757 1.6123 7.0315 1.8668 1.7370 1.3785 1.3810 6.1931 1.3938 1.4020 2.0442 2.2450 3.1017 2.9984 1.7958 1.3906 1.3555 1.0931 1.7994 1.9133 2.2174 2.2650 1.9630 1.9006 3.2526 3.9481 5.8998 6.6786 2.7345 4.1378 2.7785 2.7960 4.3470 3.5333 2.8957 5.3293 6.9618 3.7160 5.7648 7.6625 6.6480 6.4004 7.7152 7.7377 1.0871 1.0869 1.0878 1.0889 1.0923 1.0945 1.0942 1.0949 1.0999 1.0957 1.0965
irintensity: 0.3965 0.1946 0.3133 1.4488 1.1134 1.3191 2.1134 2.2883 3.7654 2.3960 0.0038 5.9789 0.0720 0.9837 0.2492 2.0027 6.4224 0.7496 1.5580 2.6882 1.6728 5.1265 15.8687 3.9945 14.2243 0.6192 0.1059 3.4774 17.7422 13.1294 0.2753 7.2531 3.1065 2.3365 70.1192 3.4872 0.0584 41.2986 0.2845 73.3980 7.0259 3.1776 0.0224 3.9533 25.5461 2.7737 4.8657 0.5084 4.4918 2.7665 0.5178 7.6934 17.9164 44.2642 41.4288 19.9525 2.1459 105.3627 17.0874 9.7902 311.3154 129.1766 116.1367 17.9565 25.6072 55.1703 65.0347 120.7918 24.1030 15.9618 22.3587 15.8264 4.4354 24.7662 2.1356 31.3386 241.2790 22.9315 7.1383 2.1109 35.4505 33.1469 61.1684 1.9651 17.3126 0.9339 4.8030 1.6494 4.8477 5.7004 17.3596 5.6606 41.7184 38.7573 4.6356 1.4538
temp: 298.150 k
press: 1.00000 atm
elementType: 8 8 7 6 6 6 6 6 6 6 6 6 6 6 6 6 6 6 6 6 6 6 6 1 1 1 1 1 1 1 1 1 1 1
symmnumber: 1
zpe: 658364.0 jmol-1
zpe.correction: 0.250758 hartree
zpe.thermalcorrener: 0.266771 hartree
zpe.thermalcorrenthalpy: 0.267715 hartree
zpe.thermalcorrgfe: 0.207162 hartree
zpe.sumelectzpe: -972.359845 hartree
zpe.sumelectthermal: -972.343831 hartree
zpe.sumelectthermalent: -972.342887 hartree
zpe.sumelectthermalfe: -972.403441 hartree
dipole: -8.0398 3.1703 0.0013
dipole: 8.6423
quadrupole: -145.4673 -114.1281 -137.2240
quadrupole: 17.2131 0.0064 -0.0015
quadrupole: -13.1942 18.1450 -4.9508 17.2131 0.0064 -0.0015
hfenergy: -972.6106022 hartree
pointgroup: C01 [X(C20H11N1O2)]
dipole: 3.1437701 -1.295254 0.0005169 debye
polarizability: 498.9610445|10.8776551|276.0759619|0.0143157|-0.010467|83.1187882 unknown
InChI: InChI=1S/C20H11NO2/c22-21(23)19-11-18-15-9-8-12-4-1-2-6-14(12)17(15)10-13-5-3-7-16(19)20(13)18/h1-11H
charge 0 multiplicity 1
34 atoms
O  -5.457829 0.625013 -0.000495
O  -4.568918 2.737002 -0.000613
N  -4.447213 1.445216 -0.000098
C  -1.380076 -0.615563 0.000056
C  -0.82038 0.692283 0.000015
C  0.595446 0.841158 0.000026
C  1.417028 -0.375266 0.000082
C  -0.620241 -1.807926 0.000106
C  -2.809909 -0.565124 0.000037
C  0.79875 -1.655205 0.000108
C  2.884942 -0.232217 0.000101
C  -1.942384 1.627022 -0.000016
C  -3.124017 0.874374 -0.000043
C  1.231068 2.134706 -0.000004
C  3.465631 1.087975 0.00006
C  -1.367764 -3.039957 0.000144
C  -3.51955 -1.771887 0.000082
C  2.60709 2.252428 0.000009
C  -2.771192 -3.003555 0.000123
C  3.775878 -1.346965 0.000156
C  4.884566 1.246216 0.000075
C  5.168566 -1.17337 0.000168
C  5.7329 0.132196 0.000127
H  1.416645 -2.55877 0.000147
H  -1.90876 2.716376 -0.000058
H  0.599696 3.028913 -0.000039
H  -0.843164 -4.002275 0.000178
H  -4.612713 -1.783552 0.000068
H  3.077147 3.242887 -0.000019
H  -3.328784 -3.946377 0.000139
H  3.382717 -2.367755 0.000191
H  5.301611 2.259943 0.000043
H  5.824689 -2.050385 0.00021
H  6.820123 0.26124 0.000135
