program: Gaussian 09
title: 000135681
version: EM64L-G09RevD.01
frameworkgroup: C1[X(C9H9BrO2)]
method: RPBEPBE
basis: SDD
operation: Freq
keyword: #p
keyword: freq=noraman
keyword: PBEPBE/SDD
title: #p freq=noraman PBEPBE/SDD
converged: YES YES NO NO
title: Mulliken charges:
elementType: Br O O C C C C C C C C C H H H H H H H H H
charge: 0.008009 -0.305620 -0.450855 -0.251516 -0.044270 0.490630 -0.374331 -0.362654 -0.393310 -0.185501 -0.183909 -0.210909 0.224567 0.255586 0.209626 0.209392 0.267897 0.240278 0.250889 0.251766 0.354235
chargesum: 0.00000
title: Mulliken charges with hydrogens summed into heavy atoms:
elementType: Br O O C C C C C C C C C
charge: 0.008009 -0.305620 -0.096620 -0.026949 0.211316 0.490630 0.044687 -0.094757 -0.153032 0.065388 0.067857 -0.210909
polarizability: 1.91382478e+02 4.79511318e+00 9.48183629e+01 5.74838497e+00 -1.33556695e+01 7.09266931e+01
1716.lowfreq: -9.9822 -2.7243 -0.0005 -0.0001 0.0005 2.3807 28.7559 44.7930 73.9128
frequency: 28.6882 44.7895 73.9048 101.5451 142.0101 199.7286 218.2536 224.6441 276.3146 338.6218 389.7858 406.4192 419.7752 448.1412 523.9128 620.7224 640.9648 710.2395 744.7899 796.6466 828.1231 833.1255 843.2015 941.2599 953.5770 968.6628 972.7389 995.8948 1036.1846 1059.3446 1078.8445 1106.4274 1112.9318 1161.2075 1184.1757 1209.1443 1235.2948 1243.8359 1290.5304 1312.4122 1367.4766 1384.7599 1401.6087 1444.2038 1475.5724 1477.5843 1580.8420 1601.4604 2955.2765 3010.6599 3088.0364 3105.9033 3132.5334 3147.4312 3170.2484 3173.3032 3581.4745
redmass: 4.5099 7.4440 4.9874 4.1218 5.7420 1.6988 2.1542 4.9495 5.3008 3.3767 4.4396 2.9052 5.3619 7.9630 3.0839 7.0507 5.8130 4.1740 4.9678 3.1928 2.7785 1.5836 1.6628 1.8914 1.3326 7.2719 1.3606 4.8058 1.4884 2.5394 1.2647 1.5462 1.5261 1.4669 1.1088 1.4184 1.4664 1.3127 1.3231 1.4558 2.6521 3.7599 1.8349 2.2370 1.0917 2.7290 7.3086 6.1270 1.0553 1.1073 1.0906 1.0899 1.0898 1.0888 1.0954 1.0966 1.0669
irintensity: 0.2525 0.5092 7.6502 2.8529 3.1731 98.5998 51.0159 15.9109 15.6685 2.1871 0.8032 0.4475 10.0386 14.4685 35.2501 0.5890 3.6862 4.3541 12.3656 49.1474 54.5204 3.7731 16.3883 43.3583 0.0560 75.9864 0.2634 43.2855 19.7163 26.7632 0.6186 6.8953 1.6924 9.6324 0.4528 2.1083 17.7734 9.5921 4.9754 6.9928 1.9785 3.6968 5.7855 18.6865 3.0552 72.0013 0.6123 10.3952 61.7657 44.5795 14.3458 25.3389 10.1613 1.0175 8.5133 0.4923 5.1361
temp: 298.150 k
press: 1.00000 atm
elementType: 35 8 8 6 6 6 6 6 6 6 6 6 1 1 1 1 1 1 1 1 1
symmnumber: 1
zpe: 411606.2 jmol-1
zpe.correction: 0.156773 hartree
zpe.thermalcorrener: 0.168610 hartree
zpe.thermalcorrenthalpy: 0.169554 hartree
zpe.thermalcorrgfe: 0.116238 hartree
zpe.sumelectzpe: -511.323382 hartree
zpe.sumelectthermal: -511.311545 hartree
zpe.sumelectthermalent: -511.310600 hartree
zpe.sumelectthermalfe: -511.363917 hartree
dipole: 3.5380 -1.0859 -0.2673
dipole: 3.7105
quadrupole: -62.0749 -79.3975 -80.2669
quadrupole: -5.0640 -3.7724 -7.6912
quadrupole: 11.8382 -5.4845 -6.3538 -5.0640 -3.7724 -7.6912
hfenergy: -511.4801547 hartree
pointgroup: C01 [X(C9H9Br1O2)]
dipole: 1.4086868 -0.3789576 -0.0558362 debye
dipolederiv: -0.7757126 -0.0557184 -0.1222561 -0.0558029 -0.0695771 0.0033339 -0.1432073 0.0016986 -0.0717703 -0.6168094 -0.0302403 -0.0252684 -0.2045926 -0.5787186 -0.1549342 -0.1342205 -0.1350921 -0.3431763 -0.2367469 0.1006504 0.0504119 0.243421 -0.6996317 -0.123123 0.1288664 -0.0738346 -0.6387137 0.3315332 0.0036619 0.0608861 0.1174664 0.2555203 -0.0490525 0.3265904 0.060381 0.2501615 0.2588464 -0.0277802 0.0531428 0.0463028 0.2144536 0.0656948 -0.1238625 -0.0204022 0.2481861 0.2385632 0.0424965 -0.0330145 0.0077918 -0.0798234 0.0259833 -0.0253012 0.0169467 -0.0752839 0.3108969 -0.0434039 -0.1192235 -0.2742823 0.5552116 0.172236 -0.0732057 0.1116969 0.4567637 -0.0720594 0.0488608 0.018601 0.015398 0.0064224 -0.0709795 0.0681008 -0.0304307 -0.094877 -0.0583898 -0.0580891 0.0721951 0.0205567 0.0246156 -0.079399 -0.0168938 -0.0936698 -0.0909697 -0.3781919 -0.1226502 -0.0006531 -0.07755 0.0010315 -0.0548543 -0.0339807 -0.0719885 -0.0668994 -0.3733762 0.0813971 -0.0971046 0.0398072 0.0122341 -0.0441588 -0.0745016 -0.0272249 -0.0918492 1.2928352 0.1117761 0.263073 0.1120272 0.0064194 -0.043594 0.2797876 -0.0459587 -0.0440578 -0.0242953 -0.0076156 -0.0484761 0.0197067 -0.0047611 0.1004513 -0.076556 0.0862444 -0.0042723 0.000334 0.047641 -0.0626926 0.0320736 0.0825364 0.0240949 -0.0459495 0.0027111 -0.0772826 0.0532705 0.0066355 -0.0244694 0.0476704 0.0025987 0.0073173 -0.0757196 -0.0302995 -0.195926 -0.1307654 -0.0957861 0.0716788 -0.0606937 -0.1206432 0.0022173 0.1136893 0.046447 0.009993 0.0687249 -0.0773045 0.0115566 -0.0611018 0.0264964 0.0568061 0.0156814 0.0391226 0.1248027 0.0183469 0.0684196 -0.0740006 0.0556993 0.016984 0.0809076 -0.0654928 0.0845337 0.0929709 0.0540935 0.0516358 -0.0478424 0.0507949 0.0299192 0.0742549 -0.0555067 0.0724007 0.11222 0.0483117 -0.0760764 0.0162011 -0.0758529 0.0143412 0.0595088 0.0118513 0.0571776 0.1343347 -0.0094095 0.0314899 0.0372549 0.0011602 0.3043709 -0.052711 -0.0001694 -0.0504594 0.3656456 unknown
polarizability: 190.4388883|8.752276|94.8089806|9.6791116|-13.3082367|71.8796655 unknown
InChI: InChI=1S/C9H9BrO2/c10-7-3-1-6(2-4-7)9-8(5-11)12-9/h1-4,8-9,11H,5H2
charge 0 multiplicity 1
21 atoms
Br -4.753214 -0.328038 -0.519145
O  2.022338 1.486005 0.655647
O  3.867264 -1.293106 -1.072519
C  1.391335 0.101763 0.691025
C  2.394295 0.450086 -0.374912
C  -0.073209 0.020721 0.414104
C  3.824509 -0.038087 -0.303199
C  -0.748611 1.063371 -0.268944
C  -0.806321 -1.118791 0.829224
C  -2.128848 0.96791 -0.547034
C  -2.186868 -1.232481 0.553774
C  -2.830547 -0.184841 -0.135737
H  1.75935 -0.517168 1.521297
H  2.013144 0.657053 -1.383955
H  4.111731 -0.199538 0.756355
H  4.49912 0.728271 -0.740027
H  -0.1927 1.964087 -0.550987
H  -0.300536 -1.930417 1.365538
H  -2.64838 1.777168 -1.067919
H  -2.7468 -2.11579 0.873287
H  4.807847 -1.528279 -1.270073
