program: Gaussian 09
title: 000011857
version: EM64L-G09RevD.01
frameworkgroup: C1[X(C8H14O4)]
method: RPBEPBE
basis: SDD
operation: Freq
keyword: #pfreq=noraman
keyword: PBEPBE/SDD
title: #p freq=noraman PBEPBE/SDD
converged: YES YES NO NO
title: Mulliken charges:
elementType: O O O O C C C C C C C C H H H H H H H H H H H H H H
charge: -0.262157 -0.262382 -0.232698 -0.235766 -0.297140 -0.701541 0.263762 0.267154 -0.227047 -0.224884 -0.673212 -0.673076 0.271882 0.248993 0.246885 0.220013 0.228265 0.233839 0.230321 0.228941 0.213018 0.234197 0.229899 0.211788 0.229376 0.231568
chargesum: 0.00000
title: Mulliken charges with hydrogens summed into heavy atoms:
elementType: O O O O C C C C C C C C
charge: -0.262157 -0.262382 -0.232698 -0.235766 -0.025257 0.014350 0.263762 0.267154 0.235057 0.234379 0.003903 -0.000344
polarizability: 1.12245268e+02 6.26784018e+00 1.08005962e+02 -9.32983897e-01 4.66215026e-01 8.12350983e+01
1716.lowfreq: -7.4253 -0.0007 -0.0006 0.0007 2.8634 5.3396 18.7759 26.1766 54.0413
frequency: 18.2345 26.1420 54.0174 59.3734 79.7077 125.8535 131.7723 145.1931 200.0584 209.3688 247.2330 252.1800 267.6208 281.8361 329.0760 345.7547 394.6432 438.4327 541.2691 658.5638 694.3393 757.1919 798.3489 799.0909 804.4903 816.4360 850.1633 906.5214 1013.8403 1023.3828 1029.0886 1079.7836 1092.5873 1111.9327 1114.7724 1121.9657 1135.8797 1136.0215 1169.2876 1248.0351 1249.9930 1280.8243 1298.8348 1355.0790 1357.6965 1393.5705 1400.1768 1401.4013 1462.5636 1464.2314 1467.9453 1473.5126 1474.9105 1480.2880 1486.5511 1487.0165 1635.0548 1647.3700 2996.2426 2996.6245 3005.3824 3010.4770 3011.8632 3021.0804 3068.9620 3071.7883 3092.9398 3093.5313 3105.9407 3107.6558 3109.3658 3117.2417
redmass: 3.8244 3.2395 3.2116 3.0108 3.6883 2.6914 2.6331 2.7521 1.0772 2.1186 1.5473 1.6752 2.4396 3.6001 5.5616 3.5145 4.1009 4.2794 5.4074 6.0739 4.5588 5.2511 1.1067 1.2084 2.9397 3.4540 4.0908 3.2270 2.0631 2.3168 1.9073 2.0629 4.3031 2.3075 2.2332 2.1016 1.4744 1.4681 3.9487 1.1373 1.1383 1.4280 1.7784 1.3706 1.4260 1.1942 1.2655 1.2633 1.0405 1.0400 1.0438 1.0619 1.0616 1.0559 1.0661 1.0688 10.1862 10.2551 1.0358 1.0358 1.0351 1.0582 1.0583 1.0823 1.1065 1.1066 1.0985 1.0985 1.1008 1.1026 1.1028 1.1008
irintensity: 0.5219 0.8145 0.8740 1.0054 1.2859 4.2906 1.4154 1.1546 0.1430 4.7840 1.7227 2.9149 2.9907 7.9298 11.8679 4.7253 2.2436 10.6800 5.3413 6.8256 0.4248 3.0282 3.2775 6.5883 8.1617 7.5443 11.3654 3.9251 5.7771 52.7402 57.2235 120.6944 191.7348 34.3938 1.6239 119.0472 11.5248 6.8438 303.2919 0.0307 0.1816 18.2575 106.8232 1.9163 2.3967 39.5766 14.1871 21.3886 11.3619 13.1129 19.9925 5.4209 2.4290 9.0157 19.6997 11.5077 170.0439 208.4464 20.0335 19.6110 21.6000 17.5463 18.7725 3.4017 7.6684 6.3598 29.8420 29.7537 14.7793 45.4387 40.8518 10.9432
temp: 298.150 k
press: 1.00000 atm
elementType: 8 8 8 8 6 6 6 6 6 6 6 6 1 1 1 1 1 1 1 1 1 1 1 1 1 1
symmnumber: 1
zpe: 557074.6 jmol-1
zpe.correction: 0.212179 hartree
zpe.thermalcorrener: 0.226941 hartree
zpe.thermalcorrenthalpy: 0.227885 hartree
zpe.thermalcorrgfe: 0.167936 hartree
zpe.sumelectzpe: -613.191087 hartree
zpe.sumelectthermal: -613.176325 hartree
zpe.sumelectthermalent: -613.175381 hartree
zpe.sumelectthermalfe: -613.235329 hartree
dipole: 1.5099 2.5714 -1.4166
dipole: 3.3013
quadrupole: -66.3171 -66.5897 -76.1262
quadrupole: -5.9157 -1.6276 2.6056
quadrupole: 3.3606 3.0879 -6.4485 -5.9157 -1.6276 2.6056
hfenergy: -613.4032659 hartree
pointgroup: C01 [X(C8H14O4)]
dipole: 0.3826841 0.5096937 1.1316959 debye
dipolederiv: -0.8175296 -0.0427232 0.4170052 -0.0927614 -0.2722167 0.1728289 0.5267606 0.1535644 -1.353603 -0.9330324 -0.1684145 -0.6306699 -0.1755695 -0.5563597 -0.2017518 -0.7053412 -0.2014622 -0.9316253 -0.8245456 0.1018534 -0.3985696 -0.0239471 -0.3031279 0.066782 0.0022772 0.090666 -0.846102 -0.5019324 0.0880605 -0.141351 -0.0602416 -0.8902722 -0.2454544 -0.1960921 0.0143921 -0.4891003 -0.4338337 0.0665586 -0.0566066 -0.0213866 0.0359714 0.0643265 -0.0928079 0.0723134 -0.1523704 -0.0085627 0.0264716 -0.0328772 0.066989 0.022173 0.0527716 -0.0369987 -0.0242786 0.0322685 1.2798962 -0.0706719 0.1887787 0.1465811 0.1923 -0.1975295 -0.3584079 -0.2069033 1.6279563 1.026161 -0.0062851 0.6710026 0.1824466 1.1601188 0.453469 0.8364639 0.1515285 0.8716508 0.6164124 0.0472209 -0.3718722 0.0549579 0.3487953 -0.0447258 -0.280347 -0.0297984 0.5219711 0.6305795 0.015718 0.2439718 -0.1088326 0.2343294 -0.0998431 0.2725906 0.0127915 0.6039412 0.018183 0.0012449 0.0413497 -0.0068455 0.0454987 0.0410274 0.0361612 0.0384276 -0.1224396 -0.0161365 -0.0473487 -0.0788957 -0.0357806 0.0084462 -0.0526714 -0.0870407 -0.0590191 -0.0294688 0.0664489 -0.021297 0.0173987 0.0008695 -0.0288687 -0.0472915 0.0165479 -0.0516023 0.0611501 0.0562411 0.0805826 -0.1052448 0.0631273 0.0483213 0.0481043 -0.0747593 0.0545619 0.0111458 0.1060231 -0.0355507 -0.0026589 -0.0261129 -0.0783359 -0.0706027 0.0187667 -0.0001449 0.0810943 -0.1179491 -0.060701 0.1043487 -0.059051 0.0864574 0.00508 0.0620967 -0.0031693 0.0496046 -0.0483076 0.0446329 0.0655754 0.0920933 -0.0793381 0.0465217 -0.0022605 0.0622598 0.0140557 -0.0308396 -0.0481435 0.0517722 -0.0765475 -0.0270256 -0.0562144 -0.0332428 -0.0812786 -0.0308764 -0.058548 -0.097946 0.0277594 -0.0260443 -0.0064267 0.0935686 -0.0188649 0.0472637 -0.0317674 -0.0490603 0.0559182 -0.0095081 0.1052329 0.005585 -0.0172461 0.0336123 -0.0879367 -0.0559242 -0.1235813 -0.0260575 0.1061944 -0.0231229 0.1135146 0.0191095 0.0893791 0.0161238 0.0265501 0.0629889 0.1133005 -0.059136 0.098704 -0.0663723 0.0380593 -0.0114273 0.0127519 0.071978 0.0715582 -0.0814966 -0.0941107 -0.0823969 -0.0393133 -0.088863 -0.0422702 -0.0588067 0.0276429 -0.0054172 0.0529513 -0.1218976 0.070853 0.02965 0.0747497 -0.1287403 0.0556902 -0.0169882 0.0320474 -0.0801454 0.0660433 -0.1097475 0.001654 0.0405089 0.1001502 0.0903632 0.018711 0.0027365 0.0922674 0.1021981 0.0465334 0.014842 -0.0947137 0.0737941 -0.0682981 0.0405452 unknown
polarizability: 109.5758389|0.3169686|81.2784419|6.6029018|-1.4627714|110.6320478 unknown
InChI: InChI=1S/C8H14O4/c1-4-11-7(9)6(3)8(10)12-5-2/h6H,4-5H2,1-3H3
charge 0 multiplicity 1
26 atoms
O  -1.553529 0.434225 0.111999
O  1.72125 0.639024 0.118251
O  -2.370566 0.738714 -2.046573
O  1.008587 -1.362557 -0.84272
C  0.076327 0.790151 -1.633305
C  0.286143 0.489905 -3.134219
C  -1.408057 0.644488 -1.254755
C  0.952084 -0.115189 -0.764674
C  -2.957639 0.296214 0.61725
C  2.605093 -0.137284 1.044195
C  -2.859378 0.001361 2.109705
C  3.347514 0.881456 1.90226
H  0.353888 1.837623 -1.409451
H  -0.431143 1.070568 -3.736501
H  0.124172 -0.582165 -3.335039
H  1.312792 0.754389 -3.440805
H  -3.493294 1.238663 0.402461
H  -3.447118 -0.517065 0.052261
H  1.964944 -0.811305 1.641591
H  3.285651 -0.758912 0.434608
H  -3.873295 -0.110731 2.535171
H  -2.30153 -0.933374 2.289001
H  -2.347989 0.821675 2.641669
H  4.013999 0.357725 2.611613
H  3.963184 1.550888 1.277432
H  2.639709 1.498813 2.481175
